1,1,1-trichloro-3,3,3-trifluoroacetone
- Formula: C3Cl3F3O
- Molecular weight: 215.386
- IUPAC Standard InChIKey: AVTAIKNWAIKGEV-UHFFFAOYSA-N
- CAS Registry Number: 758-42-9
- Chemical structure:
View 3d structure (requires JavaScript / HTML 5) - Permanent link for this species. Use this link for bookmarking this species for future reference.

Gas phase ion energetics data

Data compiled by: Sharon G. Lias, Rhoda D. Levin, and Sherif A. Kafafi
Ionization energy determinations
IE (eV) | Method | Reference | Comment |
---|---|---|---|
10.80 ± 0.01 | PE | Cocksey, Eland, et al., 1971 | |
11.24 ± 0.02 | PE | Young and Cheng, 1976 | Vertical value |

References

Cocksey, Eland, et al., 1971
Cocksey, B.J.; Eland, J.H.D.; Danby, C.J.,
The effect of alkyl substitution on ionisation potential,
J. Chem. Soc., 1971, (B), 790. [all data]
Young and Cheng, 1976
Young, V.Y.; Cheng, K.L.,
The photoelectron spectra of halogen substituted acetones,
J. Chem. Phys., 1976, 65, 3187. [all data]