Ethanol, 2,2,2-tribromo-
- Formula: C2H3Br3O
- Molecular weight: 282.757
- IUPAC Standard InChIKey: YFDSDPIBEUFTMI-UHFFFAOYSA-N
- CAS Registry Number: 75-80-9
- Chemical structure:

Phase change data

Data compiled by: Robert L. Brown and Stephen E. Stein
Reduced pressure boiling point
Tboil (K) | Pressure (atm) | Reference |
---|---|---|
365.7 | 0.013 | Weast and Grasselli, 1989 |

Gas phase ion energetics data

Data compiled by: Sharon G. Lias and Joel F. Liebman
Appearance energy determinations
Ion | AE (eV) | Other Products | Method | Reference | Comment |
---|---|---|---|---|---|
CBr3+ | 10.95 | CH2OH | EI | Holmes, Lossing, et al., 1988 | |
CH3O+ | 11.10 | CBr3 | EI | Holmes and Lossing, 1988 |

References

Weast and Grasselli, 1989
CRC Handbook of Data on Organic Compounds, 2nd Editon, Weast,R.C and Grasselli, J.G., ed(s)., CRC Press, Inc., Boca Raton, FL, 1989, 1. [all data]
Holmes, Lossing, et al., 1988
Holmes, J.L.; Lossing, F.P.; McFarlane, R.A.,
Stabilization energy and positional effects in halogen-substituted alkyl ions.,
Int. J. Mass Spectrom. Ion Phys., 1988, 86, 209. [all data]
Holmes and Lossing, 1988
Holmes, J.L.; Lossing, F.P.,
Heats of formation and bond dissociation energies in halogen-substituted methyl and ethyl radicals,
J. Am. Chem. Soc., 1988, 110, 7343. [all data]