lithium hydride
- Formula: HLi
- Molecular weight: 7.949
- IUPAC Standard InChIKey: SIAPCJWMELPYOE-UHFFFAOYSA-N
- CAS Registry Number: 7580-67-8
- Chemical structure:
View 3d structure (requires JavaScript / HTML 5) - Isotopologues:

Condensed phase thermochemistry data

Quantity | Value | Units | Method | Reference | Comment |
---|---|---|---|---|---|
ΔfH°liquid | -77.71 | kJ/mol | Review | Chase, 1998 | Data last reviewed in September, 1967 |
Quantity | Value | Units | Method | Reference | Comment |
S°liquid,1 bar | 22.23 | J/mol*K | Review | Chase, 1998 | Data last reviewed in September, 1967 |
Quantity | Value | Units | Method | Reference | Comment |
ΔfH°solid | -90.63 | kJ/mol | Review | Chase, 1998 | Data last reviewed in September, 1967 |
Quantity | Value | Units | Method | Reference | Comment |
S°solid | 20.03 | J/mol*K | Review | Chase, 1998 | Data last reviewed in September, 1967 |
Liquid Phase Heat Capacity (Shomate Equation)
Cp° = A + B*t + C*t2 + D*t3 +
E/t2
H° − H°298.15= A*t + B*t2/2 +
C*t3/3 + D*t4/4 − E/t + F − H
S° = A*ln(t) + B*t + C*t2/2 + D*t3/3 −
E/(2*t2) + G
Cp = heat capacity (J/mol*K)
H° = standard enthalpy (kJ/mol)
S° = standard entropy (J/mol*K)
t = temperature (K) / 1000.
View plot Requires a JavaScript / HTML 5 canvas capable browser.
Temperature (K) | 961.8 to 2000. |
---|---|
A | 62.34202 |
B | 0.000000 |
C | 0.000000 |
D | 0.000000 |
E | 0.000000 |
F | -96.30187 |
G | 97.67046 |
H | -77.71403 |
Reference | Chase, 1998 |
Comment | Data last reviewed in September, 1967 |
Solid Phase Heat Capacity (Shomate Equation)
Cp° = A + B*t + C*t2 + D*t3 +
E/t2
H° − H°298.15= A*t + B*t2/2 +
C*t3/3 + D*t4/4 − E/t + F − H
S° = A*ln(t) + B*t + C*t2/2 + D*t3/3 −
E/(2*t2) + G
Cp = heat capacity (J/mol*K)
H° = standard enthalpy (kJ/mol)
S° = standard entropy (J/mol*K)
t = temperature (K) / 1000.
View plot Requires a JavaScript / HTML 5 canvas capable browser.
Temperature (K) | 298. to 961.8 |
---|---|
A | 15.45842 |
B | 52.93220 |
C | -0.099970 |
D | 0.029244 |
E | -0.291667 |
F | -98.56500 |
G | 21.32355 |
H | -90.62502 |
Reference | Chase, 1998 |
Comment | Data last reviewed in September, 1967 |

Gas phase ion energetics data

Data evaluated as indicated in comments:
HL - Edward P. Hunter and Sharon G. Lias
Data compiled as indicated in comments:
B - John E. Bartmess
LLK - Sharon G. Lias, Rhoda D. Levin, and Sherif A. Kafafi
Quantity | Value | Units | Method | Reference | Comment |
---|---|---|---|---|---|
Proton affinity (review) | 1021.7 | kJ/mol | N/A | Hunter and Lias, 1998 | HL |
Quantity | Value | Units | Method | Reference | Comment |
Gas basicity | 996.4 | kJ/mol | N/A | Hunter and Lias, 1998 | HL |
Electron affinity determinations
EA (eV) | Method | Reference | Comment |
---|---|---|---|
0.342 ± 0.012 | LPES | Sarkas, Hendricks, et al., 1994 | B |
Ionization energy determinations
IE (eV) | Method | Reference | Comment |
---|---|---|---|
7.9 ± 0.3 | EI | N/A | LLK |
De-protonation reactions
Li- + =
Quantity | Value | Units | Method | Reference | Comment |
---|---|---|---|---|---|
ΔrH° | 1489.5 ± 0.42 | kJ/mol | D-EA | Haeffler, Hanstorp, et al., 1996 | gas phase; Given: 0.618049(20) eV; B |
Quantity | Value | Units | Method | Reference | Comment |
ΔrG° | 1468.1 ± 1.3 | kJ/mol | H-TS | Haeffler, Hanstorp, et al., 1996 | gas phase; Given: 0.618049(20) eV; B |

Gas phase thermochemistry data

Quantity | Value | Units | Method | Reference | Comment |
---|---|---|---|---|---|
ΔfH°gas | 140.62 | kJ/mol | Review | Chase, 1998 | Data last reviewed in September, 1967 |
Quantity | Value | Units | Method | Reference | Comment |
S°gas,1 bar | 170.91 | J/mol*K | Review | Chase, 1998 | Data last reviewed in September, 1967 |
Gas Phase Heat Capacity (Shomate Equation)
Cp° = A + B*t + C*t2 + D*t3 +
E/t2
H° − H°298.15= A*t + B*t2/2 +
C*t3/3 + D*t4/4 − E/t + F − H
S° = A*ln(t) + B*t + C*t2/2 + D*t3/3 −
E/(2*t2) + G
Cp = heat capacity (J/mol*K)
H° = standard enthalpy (kJ/mol)
S° = standard entropy (J/mol*K)
t = temperature (K) / 1000.
View plot Requires a JavaScript / HTML 5 canvas capable browser.
Temperature (K) | 2000. to 6000. |
---|---|
A | 36.28729 |
B | 1.726031 |
C | -0.246189 |
D | 0.026761 |
E | -1.821426 |
F | 125.1104 |
G | 207.9025 |
H | 140.6242 |
Reference | Chase, 1998 |
Comment | Data last reviewed in September, 1967 |

Reaction thermochemistry data

Data compiled by: John E. Bartmess
Individual Reactions
Li- + =
Quantity | Value | Units | Method | Reference | Comment |
---|---|---|---|---|---|
ΔrH° | 1489.5 ± 0.42 | kJ/mol | D-EA | Haeffler, Hanstorp, et al., 1996 | gas phase; Given: 0.618049(20) eV |
Quantity | Value | Units | Method | Reference | Comment |
ΔrG° | 1468.1 ± 1.3 | kJ/mol | H-TS | Haeffler, Hanstorp, et al., 1996 | gas phase; Given: 0.618049(20) eV |

Constants of diatomic molecules

Data compiled by: Klaus P. Huber and Gerhard H. Herzberg

Data collected through January, 1977

Symbols used in the table of constants
SymbolMeaning
State electronic state and / or symmetry symbol
Te minimum electronic energy (cm-1)
ωe vibrational constant – first term (cm-1)
ωexe vibrational constant – second term (cm-1)
ωeye vibrational constant – third term (cm-1)
Be rotational constant in equilibrium position (cm-1)
αe rotational constant – first term (cm-1)
γe rotation-vibration interaction constant (cm-1)
De centrifugal distortion constant (cm-1)
βe rotational constant – first term, centrifugal force (cm-1)
re internuclear distance (Å)
Trans. observed transition(s) corresponding to electronic state
ν00 position of 0-0 band (units noted in table)
Diatomic constants for 7LiH
StateTeωeωexeωeyeBeαeγeDeβereTrans.ν00
For ab initio calculations of X 1Σ, A 1Σ, B 1Π, a 3Σ, b 3Π (lowest stable triplet state at ~1700 cm-1 below B 1Π see Docken and Hinze, 1972. Excitation energies and oscillator strengths for higher-lying states have been computed by Stewart, Watson, et al., 1975. The most recent ground state studies are those of Meyer and Rosmus, 1975 and Yardley and Balint-Kurti, 1976, the latter including other low-lying 1Σ+ states.
B 1Π 34912 [130.73] Z 1  3.383 2 3 0.986 -0.045 [2.6E-3] 4  2.378 B ← X R 34312.26 Z
missing citation
A 1Σ+ 26516 [280.96] 5 Z   [2.8536] 5 3   [1.187E-3] 5  2.605 A ↔ X 6 7 R 25943.13 Z
Crawford and Jorgensen, 1935
X 1Σ+ 0 1405.65 Z 23.20 0.163 7.5131 3 0.2132 8 0.00075 0.8617E-3 9 -0.0160E-3 1.5957 10
Klemperer, 1955; Norris and Klemperer, 1958; James, Norris, et al., 1960
Mol. beam electric 11
Wharton, Gold, et al., 1960; Rothstein, 1969; Freeman, Jacobson, et al., 1975
and magn. Reson.
Lawrence, Anderson, et al., 1963

References

Chase, 1998
Chase, M.W., Jr.,
NIST-JANAF Themochemical Tables, Fourth Edition,
J. Phys. Chem. Ref. Data, Monograph 9, 1998, 1-1951. [all data]
Hunter and Lias, 1998
Hunter, E.P.; Lias, S.G.,
Evaluated Gas Phase Basicities and Proton Affinities of Molecules: An Update,
J. Phys. Chem. Ref. Data, 1998, 27, 3, 413-656, https://doi.org/10.1063/1.556018
. [all data]
Sarkas, Hendricks, et al., 1994
Sarkas, H.W.; Hendricks, J.H.; Arnold, S.T.; Bowen, K.H.,
Photoelectron Spectroscopy of Lithium Hydride Anion,
J. Chem. Phys., 1994, 100, 3, 1884, https://doi.org/10.1063/1.466540
. [all data]
Haeffler, Hanstorp, et al., 1996
Haeffler, G.; Hanstorp, G.; Kiyan, I.; Klinkm|ller, A.E.; Ljungblad, U.; Pegg, D.J.,
Electron affinity of Li: A state-selective measurement,
Phys. Rev. A, 1996, 53, 6, 4127-4131, https://doi.org/10.1103/PhysRevA.53.4127
. [all data]