Silane, chlorotrimethyl-
- Formula: C3H9ClSi
- Molecular weight: 108.642
- IUPAC Standard InChIKey: IJOOHPMOJXWVHK-UHFFFAOYSA-N
- CAS Registry Number: 75-77-4
- Chemical structure:

Condensed phase thermochemistry data

Data compiled by: Eugene S. Domalski and Elizabeth D. Hearing
Quantity | Value | Units | Method | Reference | Comment |
---|---|---|---|---|---|
S°liquid | 275.1 | J/mol*K | N/A | Samorukov, Kostryukov, et al., 1971 |
Constant pressure heat capacity of liquid
Cp,liquid (J/mol*K) | Temperature (K) | Reference | Comment |
---|---|---|---|
187.5 | 298.15 | Samorukov, Kostryukov, et al., 1971 | T = 12.38 to 303.05 K. Cp(liq) = 18.19046 + 0.077664T + 309052T-2 cal/mol*K. Value is calculated from equation. Deposited in VINITI, No 2501-71, 18 January 1971. |

Gas phase ion energetics data

Data evaluated as indicated in comments:
L - Sharon G. Lias
Data compiled as indicated in comments:
LBLHLM - Sharon G. Lias, John E. Bartmess, Joel F. Liebman, John L. Holmes, Rhoda D. Levin, and W. Gary Mallard
LLK - Sharon G. Lias, Rhoda D. Levin, and Sherif A. Kafafi
RDSH - Henry M. Rosenstock, Keith Draxl, Bruce W. Steiner, and John T. Herron
Quantity | Value | Units | Method | Reference | Comment |
---|---|---|---|---|---|
IE (evaluated) | 10.83 ± 0.02 | eV | N/A | N/A | L |
Ionization energy determinations
IE (eV) | Method | Reference | Comment |
---|---|---|---|
10.65 ± 0.02 | PIPECO | Szepes and Baer, 1984 | T = 298K; LBLHLM |
10.83 ± 0.02 | PIPECO | Szepes and Baer, 1984 | T = 0K; LBLHLM |
10.83 ± 0.02 | PIPECO | Szepes and Baer, 1984, 2 | T = 0K; LBLHLM |
9.9 ± 0.1 | EI | Band, Davidson, et al., 1968 | RDSH |
10.58 ± 0.04 | EI | Hess, Lampe, et al., 1965 | RDSH |
10.71 | PE | Zykov, Khvostenko, et al., 1981 | Vertical value; LLK |
10.84 | PE | Block, Biernbaum, et al., 1977 | Vertical value; LLK |
10.76 | PE | Green, Lappert, et al., 1971 | Vertical value; LLK |
Appearance energy determinations
Ion | AE (eV) | Other Products | Method | Reference | Comment |
---|---|---|---|---|---|
C2H6SiCl+ | 10.6 ± 0.1 | CH3 | EI | Band, Davidson, et al., 1968 | RDSH |
C2H6SiCl+ | 11.00 ± 0.16 | CH3 | EI | Hess, Lampe, et al., 1965 | RDSH |
C3H9Si+ | 11.6 ± 0.1 | Cl | EI | Potzinger, Ritter, et al., 1975 | LLK |
C3H9Si+ | 10.9 ± 0.1 | Cl | EI | Band, Davidson, et al., Commun. 1967 | RDSH |
C3H9Si+ | 11.5 ± 0.2 | Cl | EI | Connor, Finney, et al., 1966 | RDSH |
C3H9Si+ | 12.40 ± 0.06 | Cl | EI | Hess, Lampe, et al., 1965 | RDSH |
C3H9Si+ | 12.42 ± 0.03 | Cl | EI | Hess, Lampe, et al., 1964 | RDSH |

Reaction thermochemistry data

Data compiled by: John E. Bartmess
Individual Reactions
+
= C3H9Cl2Si-
By formula: Cl- + C3H9ClSi = C3H9Cl2Si-
Quantity | Value | Units | Method | Reference | Comment |
---|---|---|---|---|---|
ΔrH° | 59.8 ± 5.9 | kJ/mol | CIDT | Hao, Kaspar, et al., 2005 | gas phase |

Ion clustering data

Data compiled by: John E. Bartmess
Clustering reactions
+
= C3H9Cl2Si-
By formula: Cl- + C3H9ClSi = C3H9Cl2Si-
Quantity | Value | Units | Method | Reference | Comment |
---|---|---|---|---|---|
ΔrH° | 59.8 ± 5.9 | kJ/mol | CIDT | Hao, Kaspar, et al., 2005 | gas phase |

Phase change data

Data compiled as indicated in comments:
BS - Robert L. Brown and Stephen E. Stein
TRC - Thermodynamics Research Center, NIST Boulder Laboratories, Chris Muzny director
AC - William E. Acree, Jr., James S. Chickos
CAL - James S. Chickos, William E. Acree, Jr., Joel F. Liebman, Students of Chem 202 (Introduction to the Literature of Chemistry), University of Missouri -- St. Louis
DH - Eugene S. Domalski and Elizabeth D. Hearing
Quantity | Value | Units | Method | Reference | Comment |
---|---|---|---|---|---|
Tboil | 330. | K | N/A | PCR Inc., 1990 | BS |
Tboil | 330.75 | K | N/A | Rugina, Gaspar, et al., 1987 | Uncertainty assigned by TRC = 0.5 K; TRC |
Tboil | 331. | K | N/A | McBride and Beachell, 1948 | Uncertainty assigned by TRC = 3. K; TRC |
Tboil | 330.85 | K | N/A | Sauer and Hadsell, 1948 | Uncertainty assigned by TRC = 0.5 K; TRC |
Quantity | Value | Units | Method | Reference | Comment |
Tfus | 233. | K | N/A | Taylor and Walten, 1944 | Uncertainty assigned by TRC = 5. K; TRC |
Quantity | Value | Units | Method | Reference | Comment |
Ttriple | 217.97 | K | N/A | Samorukov, Kostryukov, et al., 1971, 2 | Crystal phase 1 phase; Uncertainty assigned by TRC = 0.02 K; TRC |
Quantity | Value | Units | Method | Reference | Comment |
Tc | 497.8 | K | N/A | Stepanov and Nozdrev, 1968 | Uncertainty assigned by TRC = 0.3 K; TRC |
Quantity | Value | Units | Method | Reference | Comment |
Pc | 31.58 | atm | N/A | Stepanov and Nozdrev, 1968 | Uncertainty assigned by TRC = 0.1099 atm; TRC |
Quantity | Value | Units | Method | Reference | Comment |
ρc | 2.73 | mol/l | N/A | Stepanov and Nozdrev, 1968 | Uncertainty assigned by TRC = 0.03 mol/l; ultrasonic velocity measurements; TRC |
Enthalpy of vaporization
ΔvapH (kcal/mol) | Temperature (K) | Reference | Comment |
---|---|---|---|
7.36 | 289. | Capková and Fried, 1964 | Based on data from 274. to 325. K.; AC |
7.22 | 291. | Jenkins and Chambers, 1954 | Based on data from 276. to 329. K.; AC |
Antoine Equation Parameters
log10(P) = A − (B / (T + C))
P = vapor pressure (atm)
T = temperature (K)
View plot Requires a JavaScript / HTML 5 canvas capable browser.
Temperature (K) | A | B | C | Reference | Comment |
---|---|---|---|---|---|
274.3 to 326.03 | 3.9599 | 1123.68 | -47.171 | Capková and Fried, 1964 | Coefficents calculated by NIST from author's data. |
275.8 to 328.8 | 4.06973 | 1191. | -38. | Jenkins and Chambers, 1954 |
Enthalpy of fusion
ΔfusH (kcal/mol) | Temperature (K) | Reference | Comment |
---|---|---|---|
2.31 | 218. | Domalski and Hearing, 1996 | AC |
Entropy of fusion
ΔfusS (cal/mol*K) | Temperature (K) | Reference | Comment |
---|---|---|---|
0.896 | 185.1 | Domalski and Hearing, 1996 | CAL |
10.62 | 218.0 |
Enthalpy of phase transition
ΔHtrs (kcal/mol) | Temperature (K) | Initial Phase | Final Phase | Reference | Comment |
---|---|---|---|---|---|
0.166 | 185.1 | crystaline, II | crystaline, I | Samorukov, Kostryukov, et al., 1971 | DH |
2.314 | 217.97 | crystaline, I | liquid | Samorukov, Kostryukov, et al., 1971 | DH |
Entropy of phase transition
ΔStrs (cal/mol*K) | Temperature (K) | Initial Phase | Final Phase | Reference | Comment |
---|---|---|---|---|---|
0.896 | 185.1 | crystaline, II | crystaline, I | Samorukov, Kostryukov, et al., 1971 | DH |
10.61 | 217.97 | crystaline, I | liquid | Samorukov, Kostryukov, et al., 1971 | DH |

Kovats' RI, non-polar column, isothermal

View large format table.

Column type Active phase Temperature (C) I Reference Comment
PackedSE-30100.555.Kirichenko, Markov, et al., 1975Ar; Column length: 1. m
PackedSE-3070.552.Kirichenko, Markov, et al., 1975Ar; Column length: 1. m
PackedPolymethylsiloxane, (PMS-20000)50.552.4Ainshtein and Shulyatieva, 1972He, Chromosorb W; Column length: 2. m
PackedSE-3040.553.Garzó, Fekete, et al., 1967N2, Chromosorb W; Column length: 2. m

Normal alkane RI, non-polar column, temperature ramp

View large format table.

Column type Active phase I Reference Comment
CapillaryOV-101560.Zenkevich, 200525. m/0.20 mm/0.10 μm, N2/He, 6. K/min; Tstart: 50. C; Tend: 250. C

Normal alkane RI, non-polar column, custom temperature program

View large format table.

Column type Active phase I Reference Comment
CapillaryPolydimethyl siloxanes560.Zenkevich, 2001Program: not specified
CapillaryMethyl Silicone560.Zenkevich, 2001, 2Program: not specified

References

Samorukov, Kostryukov, et al., 1971
Samorukov, O.P.; Kostryukov, V.N.; Samorukova, N.Kh.,
Thermodynamics of chlorosilanes with organic substituents. Low-temperature heat capacity, temperatures, and heats of phase transformation and thermodynamics functions of the condensed phase of chlorotrimethylsilane,
Russ. J. Phys. Chem., 1971, 45, 562-563. [all data]
Szepes and Baer, 1984
Szepes, L.; Baer, T.,
Dissociation dynamics of energy selected hexamethyldisilane ions and the heats of formation of (CH3)3Si+ and (CH3)3Si,
J. Am. Chem. Soc., 1984, 106, 273. [all data]
Szepes and Baer, 1984, 2
Szepes, L.; Baer, T.,
(CH3)3SiX tipusu vegyuletek vizsgalata fotoelectron-fotoion koincidenciaval,I. Meghatarozott belso energiaju hexametil-diszilan-ionok disszociaciojanak dinamikaja,
Magy. Kem. Foly., 1984, 90, 104. [all data]
Band, Davidson, et al., 1968
Band, S.J.; Davidson, I.M.T.; Lambert, C.A.,
Bond dissociation energies: electron impact studies on some trimethylsilyl compounds,
J. Chem. Soc. A, 1968, 2068. [all data]
Hess, Lampe, et al., 1965
Hess, G.G.; Lampe, F.W.; Sommer, L.H.,
An electron impact study of ionization and dissociation of trimethylsilanes,
J. Am. Chem. Soc., 1965, 87, 5327. [all data]
Zykov, Khvostenko, et al., 1981
Zykov, B.G.; Khvostenko, V.I.; Voronkov, M.G.; Yur'ev, V.P.; Lomakin, G.S.; Suslova, E.N.,
Photoelectron spectra of Si-substituted chloromethylsilanes,
Dokl. Akad. Nauk SSSR, 1981, 258, 135. [all data]
Block, Biernbaum, et al., 1977
Block, T.F.; Biernbaum, M.; West, R.,
Cyclic polysilanes XII. Photoelectron spectra and bonding in 1,2,3,4-tetra-t-butyltetramethylcyclotetrasilane and related t-butylsilicon compounds,
J. Organomet. Chem., 1977, 131, 199. [all data]
Green, Lappert, et al., 1971
Green, M.C.; Lappert, M.F.; Pedley, J.B.; Schmidt, W.; Wilkins, B.T.,
Photoelectron spectra energy level trends in MenSiCl4-n and related series,
J. Organomet. Chem., 1971, 31, 55. [all data]
Potzinger, Ritter, et al., 1975
Potzinger, P.; Ritter, A.; Krause, J.,
Massenspektrometrische Bestimmung von Bindungsenergien in siliciumorganischen Verbindungen,
Z. Naturforsch. A:, 1975, 30, 347. [all data]
Band, Davidson, et al., Commun. 1967
Band, S.J.; Davidson, I.M.T.; Lambert, C.A.; Stephenson, I.L.,
Bond dissociation energies and heats of formation of trimethylsilyl compounds,
Chem., Commun. 1967, 723. [all data]
Connor, Finney, et al., 1966
Connor, J.A.; Finney, G.; Leigh, G.J.; Haszeldine, R.N.; Robinson, P.J.; Sedgwick, R.D.; Simmons, R.F.,
Bond dissociation energies in organosilicon compounds,
Chem. Commun., 1966, 178. [all data]
Hess, Lampe, et al., 1964
Hess, G.G.; Lampe, F.W.; Sommer, L.H.,
Bond dissociation energies and ion energetics in organosilicon compounds by electron impact,
J. Am. Chem. Soc., 1964, 86, 3174. [all data]