Lead, tetramethyl-
- Formula: C4H12Pb
- Molecular weight: 267.3
- IUPAC Standard InChIKey: XOOGZRUBTYCLHG-UHFFFAOYSA-N
- CAS Registry Number: 75-74-1
- Chemical structure:

Condensed phase thermochemistry data

Data compiled as indicated in comments:
MS - José A. Martinho Simões
DH - Eugene S. Domalski and Elizabeth D. Hearing
Quantity | Value | Units | Method | Reference | Comment |
---|---|---|---|---|---|
ΔfH°liquid | 98.1 ± 4.4 | kJ/mol | Review | Martinho Simões | Selected data; MS |
ΔfH°liquid | 129.6 ± 3.3 | kJ/mol | Review | Martinho Simões | MS |
ΔfH°liquid | -25. ± 13. | kJ/mol | Review | Martinho Simões | The enthalpy of formation of Pb(Me)4(l) is calculated as -3. ± 13. kJ/mol by assuming that PbO(cr, yellow) is the product oxide.; MS |
Quantity | Value | Units | Method | Reference | Comment |
ΔcH°liquid | -3711.2 ± 1.3 | kJ/mol | CC-RB | Good, Scott, et al., 1959 | Please also see Pedley and Rylance, 1977 and Cox and Pilcher, 1970.; MS |
ΔcH°liquid | -3636.7 ± 3.2 | kJ/mol | CC-SB | Chlupacek, 1953 | MS |
ΔcH°liquid | -3505. ± 13. | kJ/mol | CC-SB | Lippincott and Tobin, 1953 | MS |
Quantity | Value | Units | Method | Reference | Comment |
S°liquid | 319.99 | J/mol*K | N/A | Good, Scott, et al., 1959, 2 | DH |
Constant pressure heat capacity of liquid
Cp,liquid (J/mol*K) | Temperature (K) | Reference | Comment |
---|---|---|---|
202.5 | 298.15 | Good, Scott, et al., 1959, 2 | DH |

Phase change data

Data compiled as indicated in comments:
TRC - Thermodynamics Research Center, NIST Boulder Laboratories, Chris Muzny director
MS - José A. Martinho Simões
AC - William E. Acree, Jr., James S. Chickos
DH - Eugene S. Domalski and Elizabeth D. Hearing
Quantity | Value | Units | Method | Reference | Comment |
---|---|---|---|---|---|
Tfus | 242.92 | K | N/A | Staveley, Warren, et al., 1954 | Uncertainty assigned by TRC = 0.1 K; TRC |
Quantity | Value | Units | Method | Reference | Comment |
ΔvapH° | 38.0 ± 0.4 | kJ/mol | CC-RB | Abraham and Irving, 1980 | MS |
Enthalpy of vaporization
ΔvapH (kJ/mol) | Temperature (K) | Reference | Comment |
---|---|---|---|
35.7 | 303. | Tanaka and Nagai, 1929 | Based on data from 298. to 308. K.; AC |
Antoine Equation Parameters
log10(P) = A − (B / (T + C))
P = vapor pressure (bar)
T = temperature (K)
View plot Requires a JavaScript / HTML 5 canvas capable browser.
Temperature (K) | A | B | C | Reference | Comment |
---|---|---|---|---|---|
273. to 333. | 4.14259 | 1376.726 | -50.129 | Good, Douslin, et al., 1959 | Coefficents calculated by NIST from author's data. |
Enthalpy of fusion
ΔfusH (kJ/mol) | Temperature (K) | Reference | Comment |
---|---|---|---|
10.799 | 242.92 | Staveley, Warren, et al., 1954, 2 | DH |
10.8 | 242.9 | Domalski and Hearing, 1996 | AC |
Entropy of fusion
ΔfusS (J/mol*K) | Temperature (K) | Reference | Comment |
---|---|---|---|
44.43 | 242.92 | Staveley, Warren, et al., 1954, 2 | DH |

Gas phase ion energetics data

Data compiled as indicated in comments:
LLK - Sharon G. Lias, Rhoda D. Levin, and Sherif A. Kafafi
RDSH - Henry M. Rosenstock, Keith Draxl, Bruce W. Steiner, and John T. Herron
Ionization energy determinations
IE (eV) | Method | Reference | Comment |
---|---|---|---|
8.50 ± 0.04 | PE | Jonas, Schweitzer, et al., 1973 | LLK |
8.8 ± 0.1 | PE | Evans, Green, et al., 1972 | LLK |
8.26 ± 0.17 | EI | Lappert, Pedley, et al., 1971 | LLK |
9.3 | EI | deRidder and Dijkstra, 1967 | RDSH |
8.0 ± 0.4 | EI | Hobrock and Kiser, 1961 | RDSH |
Appearance energy determinations
Ion | AE (eV) | Other Products | Method | Reference | Comment |
---|---|---|---|---|---|
CH3Pb+ | 13.1 | ? | EI | deRidder and Dijkstra, 1967 | RDSH |
CH3Pb+ | 12.4 ± 0.2 | ? | EI | Hobrock and Kiser, 1961 | RDSH |
C2H6Pb+ | 12.7 | ? | EI | deRidder and Dijkstra, 1967 | RDSH |
C2H6Pb+ | 11.6 ± 0.2 | ? | EI | Hobrock and Kiser, 1961 | RDSH |
C3H9Pb+ | 8.77 ± 0.16 | CH3 | EI | Lappert, Pedley, et al., 1971 | LLK |
C3H9Pb+ | 10.1 | CH3 | EI | deRidder and Dijkstra, 1967 | RDSH |
C3H9Pb+ | 8.9 ± 0.1 | CH3 | EI | Hobrock and Kiser, 1961 | RDSH |
PbH+ | 15.3 | ? | EI | deRidder and Dijkstra, 1967 | RDSH |
Pb+ | 14.4 | ? | EI | deRidder and Dijkstra, 1967 | RDSH |

Gas phase thermochemistry data

Data compiled by: José A. Martinho Simões
Quantity | Value | Units | Method | Reference | Comment |
---|---|---|---|---|---|
ΔfH°gas | 32.5 ± 1.1 | kcal/mol | Review | Martinho Simões | Selected data |
ΔfH°gas | 40.06 ± 0.79 | kcal/mol | Review | Martinho Simões | |
ΔfH°gas | 3.2 ± 3.1 | kcal/mol | Review | Martinho Simões |

References

Martinho Simões
Martinho Simões, J.A.,
Private communication (see http://webbook.nist.gov/chemistry/om/). [all data]
Good, Scott, et al., 1959
Good, W.D.; Scott, D.W.; Lacina, J.L.; McCullough, J.P.,
J. Phys. Chem., 1959, 63, 1139. [all data]
Pedley and Rylance, 1977
Pedley, J.B.; Rylance, J.,
Computer Analysed Thermochemical Data: Organic and Organometallic Compounds, University of Sussex, Brigton, 1977. [all data]
Cox and Pilcher, 1970
Cox, J.D.; Pilcher, G.,
Thermochemistry of Organic and Organometallic Compounds
in Academic Press, New York, 1970. [all data]
Chlupacek, 1953
Chlupacek, W.,
Chem. Tech., 1953, art 8. [all data]
Lippincott and Tobin, 1953
Lippincott, E.R.; Tobin, M.C.,
J. Am. Chem. Soc., 1953, 75, 4141. [all data]
Good, Scott, et al., 1959, 2
Good, W.D.; Scott, D.W.; Lacina, J.L.; McCullough, J.P.,
Tetramethyllead: heat of formation by rotating-bomb calorimetry,
J. Phys. Chem., 1959, 63, 1139-1142. [all data]
Staveley, Warren, et al., 1954
Staveley, L.A.K.; Warren, J.B.; Paget, H.P.; Dowrick, D.J.,
Some Thermodynamic Properties of Compounds of the Formula MX4 II. Tetraalkyl Compounds,
J. Chem. Soc., 1954, 1954, 1992. [all data]
Abraham and Irving, 1980
Abraham, M.H.; Irving, R.J.,
J. Chem. Thermodyn., 1980, 12, 539. [all data]
Tanaka and Nagai, 1929
Tanaka, Y.; Nagai, Y.,
Proc. Imp. Acad. (Tokyo), 1929, 5, 78. [all data]
Good, Douslin, et al., 1959
Good, W.D.; Douslin, D.R.; Scott, D.W.; George, A.; Lacina, J.L.; Dawson, J.P.; Waddington, G.,
Thermochemistry and vapor pressure of aliphatic fluorocarbons. A comparison of the C-F and C-H thermochemical bond energies,
J. Phys. Chem., 1959, 63, 1133-1138. [all data]
Staveley, Warren, et al., 1954, 2
Staveley, L.A.K.; Warren, J.B.; Paget, H.P.; Dowrick, D.J.,
Some thermodynamic properties of compounds of the formula MX4. Part II. Tetra-alkyl compounds, 1954, J. [all data]
Domalski and Hearing, 1996
Domalski, Eugene S.; Hearing, Elizabeth D.,
Heat Capacities and Entropies of Organic Compounds in the Condensed Phase. Volume III,
J. Phys. Chem. Ref. Data, 1996, 25, 1, 1, https://doi.org/10.1063/1.555985
. [all data]
Jonas, Schweitzer, et al., 1973
Jonas, A.E.; Schweitzer, G.K.; Grimm, F.A.; Carlson, T.A.,
The photoelectron spectra of the tetrafluoro and tetramethyl compounds of the group IV elements,
J. Electron Spectrosc. Relat. Phenom., 1973, 1, 29. [all data]
Evans, Green, et al., 1972
Evans, S.; Green, J.C.; Joachim, P.J.; Orchard, A.F.; Turner, D.W.; Maier, J.P.,
Electronic structures of the Group IVB tetramethyls by helium-(I) photoelectron spectroscopy,
J. Chem. Soc. Faraday Trans. 2, 1972, 68, 905. [all data]
Lappert, Pedley, et al., 1971
Lappert, M.F.; Pedley, J.B.; Simpson, J.; Spalding, T.R.,
Bonding studies of compounds of boron and the Group IV elements. VI. Mass spectrometric studies on compounds Me4M and Me3M-M'Me3 (M and M'=C, Si, Ge, Sn, and Pb): thermochemical data,
J. Organomet. Chem., 1971, 29, 195. [all data]
deRidder and Dijkstra, 1967
deRidder, J.J.; Dijkstra, G.,
Mass spectra of the tetramethyl and tetraethyl compounds of carbon, silicon, germanium, tin and lead,
Rec. Trav. Chim., 1967, 86, 737. [all data]
Hobrock and Kiser, 1961
Hobrock, B.G.; Kiser, R.W.,
Electron impact spectroscopy of tetramethylsilicon, -tin and -lead,
J. Phys. Chem., 1961, 65, 2186. [all data]