1-Propanethiol, 3-bromo-
- Formula: C3H7BrS
- Molecular weight: 155.057
- IUPAC Standard InChIKey: PLMNEJBJFZHNGF-UHFFFAOYSA-N
- CAS Registry Number: 75694-39-2
- Chemical structure:
View 3d structure (requires JavaScript / HTML 5) - Permanent link for this species. Use this link for bookmarking this species for future reference.

Gas phase ion energetics data

Data compiled by: Sharon G. Lias, Rhoda D. Levin, and Sherif A. Kafafi
Appearance energy determinations
Ion | AE (eV) | Other Products | Method | Reference | Comment |
---|---|---|---|---|---|
C3H7S+ | 9.5 ± 0.15 | Br | EI | Broer and Weringa, 1980 |

References

Broer and Weringa, 1980
Broer, W.J.; Weringa, W.D.,
Potential energy profiles for the unimolecular reactions of [C3H7S]+ ions,
Org. Mass Spectrom., 1980, 15, 229. [all data]