Dimethyl methylphosphonate
- Formula: C3H9O3P
- Molecular weight: 124.0755
- IUPAC Standard InChIKey: VONWDASPFIQPDY-UHFFFAOYSA-N
- CAS Registry Number: 756-79-6
- Chemical structure:

Phase change data

Data compiled as indicated in comments:
AC - William E. Acree, Jr., James S. Chickos
Quantity | Value | Units | Method | Reference | Comment |
---|---|---|---|---|---|
ΔvapH° | 52.8 | kJ/mol | GS | Butrow, Buchanan, et al., 2009 | Based on data from 258. to 454. K.; AC |
Enthalpy of vaporization
ΔvapH (kJ/mol) | Temperature (K) | Method | Reference | Comment |
---|---|---|---|---|
54.9 | 273. | GS | Butrow, Buchanan, et al., 2009 | Based on data from 258. to 454. K.; AC |
51.8 | 313. | GS | Butrow, Buchanan, et al., 2009 | Based on data from 258. to 454. K.; AC |
50.6 | 333. | GS | Butrow, Buchanan, et al., 2009 | Based on data from 258. to 454. K.; AC |
49.5 | 353. | GS | Butrow, Buchanan, et al., 2009 | Based on data from 258. to 454. K.; AC |
64. | 351. | A | Stephenson and Malanowski, 1987 | Based on data from 336. to 408. K. See also Frazer, Gerrard, et al., 1955.; AC |
Antoine Equation Parameters
log10(P) = A − (B / (T + C))
P = vapor pressure (bar)
T = temperature (K)
View plot Requires a JavaScript / HTML 5 canvas capable browser.
Temperature (K) | A | B | C | Reference | Comment |
---|---|---|---|---|---|
336. to 408. | 1.82239 | 444.796 | -224.556 | Kosolapoff, 1955 | Coefficents calculated by NIST from author's data. |

Gas phase ion energetics data

Data compiled as indicated in comments:
LLK - Sharon G. Lias, Rhoda D. Levin, and Sherif A. Kafafi
RDSH - Henry M. Rosenstock, Keith Draxl, Bruce W. Steiner, and John T. Herron
Ionization energy determinations
IE (eV) | Method | Reference | Comment |
---|---|---|---|
10.00 | PE | Zverev and Villem, 1980 | LLK |
10.00 | PE | Zverev, Villem, et al., 1979 | LLK |
10.71 | PE | Chattorpadhyay, Findley, et al., 1981 | Vertical value; LLK |
Appearance energy determinations
Ion | AE (eV) | Other Products | Method | Reference | Comment |
---|---|---|---|---|---|
CHO+ | 18.9 ± 0.8 | ? | EI | Bafus, Gallegos, et al., 1966 | RDSH |
CH3+ | 16.8 ± 0.1 | ? | EI | Bafus, Gallegos, et al., 1966 | RDSH |
CH3O+ | 13.8 ± 0.2 | ? | EI | Bafus, Gallegos, et al., 1966 | RDSH |
CH4OP+ | 16.9 ± 0.2 | ? | EI | Bafus, Gallegos, et al., 1966 | RDSH |
CH4O2P+ | 13.4 ± 0.3 | ? | EI | Bafus, Gallegos, et al., 1966 | RDSH |
CH5O2P+ | 11.9 | ? | EI | Bafus, Gallegos, et al., 1966 | RDSH |
C2H5O+ | 16.3 ± 0.1 | ? | EI | Bafus, Gallegos, et al., 1966 | RDSH |
C2H6O2P+ | 12.5 ± 0.1 | ? | EI | Bafus, Gallegos, et al., 1966 | RDSH |
C2H6O3P+ | 13.3 ± 0.3 | CH3 | EI | Bafus, Gallegos, et al., 1966 | RDSH |
C2H7O2P+ | 11.5 ± 0.2 | CH2O | EI | Bafus, Gallegos, et al., 1966 | RDSH |
PO+ | 19.4 ± 0.3 | ? | EI | Bafus, Gallegos, et al., 1966 | RDSH |

Kovats' RI, non-polar column, isothermal

View large format table.

Column type Active phase Temperature (C) I Reference Comment
CapillaryMethyl Silicone100.839.Huber, Kenndler, et al., 1993H2; Column length: 5. m; Phase thickness: 2.65 μm
CapillaryMethyl Silicone120.839.Huber, Kenndler, et al., 1993H2; Column length: 5. m; Phase thickness: 2.65 μm
CapillaryMethyl Silicone80.840.Huber, Kenndler, et al., 1993H2; Column length: 5. m; Phase thickness: 2.65 μm

Kovats' RI, polar column, isothermal

View large format table.

Column type Active phase Temperature (C) I Reference Comment
CapillaryPEG-20M130.1493.Huber, Kenndler, et al., 1993Column length: 10. m; Phase thickness: 1.33 μm
CapillaryPEG-20M150.1501.Huber, Kenndler, et al., 1993Column length: 10. m; Phase thickness: 1.33 μm
CapillaryPEG-20M130.1493.6Huber, Kenndler, et al., 1993Column length: 10. m; Phase thickness: 1.33 μm

Van Den Dool and Kratz RI, non-polar column, temperature ramp

View large format table.

Column type Active phase I Reference Comment
CapillarySE-54881.Kostiainen, 200025. m/0.32 mm/0.25 μm, He, 40. C @ 1. min, 10. K/min, 280. C @ 10. min

Normal alkane RI, non-polar column, temperature ramp

View large format table.

Column type Active phase I Reference Comment
CapillarySE-54880.9Söderström, Ketola, et al., 199525. m/0.32 mm/0.25 μm, He, 40. C @ 2. min, 10. K/min, 250. C @ 10. min

Normal alkane RI, non-polar column, custom temperature program

View large format table.

Column type Active phase I Reference Comment
CapillaryPolydimethyl siloxane915.Staples, 2006Program: not specified
CapillaryDB-5 MS868.Tsunoda, 200530. m/0.25 mm/0.25 μm, Helium; Program: 45 0C (2 min) 8 0C/min -> 125 0C 15 0C/min -> 280 0C
CapillaryDB-5 MS876.Tsunoda, 200530. m/0.25 mm/0.25 μm, Helium; Program: 45 0C (2 min) 8 0C/min -> 125 0C 15 0C/min -> 280 0C
Capillary5 % Phenyl methyl siloxane881.OPCW, 1997Program: not specified

References

Butrow, Buchanan, et al., 2009
Butrow, Ann B.; Buchanan, James H.; Tevault, David E.,
Vapor Pressure of Organophosphorus Nerve Agent Simulant Compounds,
J. Chem. Eng. Data, 2009, 54, 6, 1876-1883, https://doi.org/10.1021/je8010024
. [all data]
Stephenson and Malanowski, 1987
Stephenson, Richard M.; Malanowski, Stanislaw,
Handbook of the Thermodynamics of Organic Compounds, 1987, https://doi.org/10.1007/978-94-009-3173-2
. [all data]
Frazer, Gerrard, et al., 1955
Frazer, M.J.; Gerrard, W.; Coulson, C.A.; Orgel, L.E.; Taylor, W.; Weiss, J.; Taylor, W.I.; Uyeo, S.; Yajima, H.; Kosolapoff, Gennady M.; McQuillin, F.J.; Stewart, J.; Henbest, H.B.; Owen, T.C.; Nayler, P.; Whiting, M.C.; Cadogan, J.I.G.,
Notes,
J. Chem. Soc., 1955, 2959, https://doi.org/10.1039/jr9550002959
. [all data]
Kosolapoff, 1955
Kosolapoff, G.M.,
Vapour Pressures and Densities of Some Lower Alkylphosphonates,
J. Chem. Soc., 1955, 2964-2965. [all data]
Zverev and Villem, 1980
Zverev, V.V.; Villem, Y.Y.,
Ionizationp potentials of phosphoryl compounds,
J. Struct. Chem., 1980, 21, 22, In original 30. [all data]
Zverev, Villem, et al., 1979
Zverev, V.V.; Villem, Ya.Ya.; Bel'skii, V.E.; Kitaev, Yu.P.,
The photoelectronic spectra of phosphoryl compounds,
Izv. Akad. Nauk SSSR, Ser. Khim., 1979, 1, 84. [all data]
Chattorpadhyay, Findley, et al., 1981
Chattorpadhyay, S.; Findley, G.L.; McGlynn, S.P.,
Photoelectron spectroscopy of phosphites and phosphates,
J. Electron Spectrosc. Relat. Phenom., 1981, 24, 27. [all data]
Bafus, Gallegos, et al., 1966
Bafus, D.A.; Gallegos, E.J.; Kiser, R.W.,
An electron impact investigation of some alkyl phosphate esters,
J. Phys. Chem., 1966, 70, 2614. [all data]