2-Propanamine, 2-methyl-
- Formula: C4H11N
- Molecular weight: 73.1368
- IUPAC Standard InChIKey: YBRBMKDOPFTVDT-UHFFFAOYSA-N
- CAS Registry Number: 75-64-9
- Chemical structure:
View 3d structure (requires JavaScript / HTML 5) - Other names: tert-Butylamine; Trimethylaminomethane; 1,1-Dimethylethylamine; 2-Amino-2-Methylpropane; 2-Aminoisobutane; 2-Methyl-2-aminopropane; 2-Methyl-2-propylamine; tert-C4H9NH2; 2-Methyl-2-propanamine; t-Butylamine; Butylamine, tert; Butylamine, tertiary; 1,1-Dimethylethanamine; 1-Amino-1,1-dimethylethane; Erbumine; NSC 9571

Phase change data

Data compiled as indicated in comments:
BS - Robert L. Brown and Stephen E. Stein
TRC - Thermodynamics Research Center, NIST Boulder Laboratories, Chris Muzny director
AC - William E. Acree, Jr., James S. Chickos
ALS - Hussein Y. Afeefy, Joel F. Liebman, and Stephen E. Stein
DRB - Donald R. Burgess, Jr.
DH - Eugene S. Domalski and Elizabeth D. Hearing
Quantity | Value | Units | Method | Reference | Comment |
---|---|---|---|---|---|
Tboil | 318. ± 2. | K | AVG | N/A | Average of 12 values; Individual data points |
Quantity | Value | Units | Method | Reference | Comment |
Tfus | 205.65 | K | N/A | Timmermans and Mattaar, 1921 | Uncertainty assigned by TRC = 1.5 K; TRC |
Quantity | Value | Units | Method | Reference | Comment |
Ttriple | 206.19 | K | N/A | Finke, Messerly, et al., 1972 | Crystal phase 1 phase; Uncertainty assigned by TRC = 0.01 K; second-order transition; TRC |
Ttriple | 206.21 | K | N/A | Anonymous, 1964 | Crystal phase 1 phase; Uncertainty assigned by TRC = 0.05 K; TRC |
Quantity | Value | Units | Method | Reference | Comment |
Tc | 483.9 | K | N/A | Kobe and Mathews, 1970 | Uncertainty assigned by TRC = 0.5 K; TRC |
Quantity | Value | Units | Method | Reference | Comment |
Pc | 38.40 | bar | N/A | Kobe and Mathews, 1970 | Uncertainty assigned by TRC = 0.5066 bar; TRC |
Quantity | Value | Units | Method | Reference | Comment |
ρc | 3.42 | mol/l | N/A | Kobe and Mathews, 1970 | Uncertainty assigned by TRC = 0.27 mol/l; TRC |
Quantity | Value | Units | Method | Reference | Comment |
ΔvapH° | 29.8 ± 0.6 | kJ/mol | AVG | N/A | Average of 6 values; Individual data points |
Enthalpy of vaporization
ΔvapH (kJ/mol) | Temperature (K) | Method | Reference | Comment |
---|---|---|---|---|
28.27 | 317.2 | N/A | Majer and Svoboda, 1985 | |
30.1 | 307. | A,EB,IP | Stephenson and Malanowski, 1987 | Based on data from 292. to 349. K. See also Osborn and Douslin, 1968.; AC |
Antoine Equation Parameters
log10(P) = A − (B / (T + C))
P = vapor pressure (bar)
T = temperature (K)
View plot Requires a JavaScript / HTML 5 canvas capable browser.
Temperature (K) | A | B | C | Reference |
---|---|---|---|---|
292.47 to 348.36 | 3.90694 | 992.719 | -62.727 | Osborn and Douslin, 1968 |
Enthalpy of fusion
ΔfusH (kJ/mol) | Temperature (K) | Reference | Comment |
---|---|---|---|
0.88 | 206.2 | Domalski and Hearing, 1996 | AC |
Enthalpy of phase transition
ΔHtrs (kJ/mol) | Temperature (K) | Initial Phase | Final Phase | Reference | Comment |
---|---|---|---|---|---|
0.11351 | 91.30 | crystaline, III | crystaline, II | Finke, Messerly, et al., 1972, 2 | DH |
6.0526 | 202.27 | crystaline, II | crystaline, I | Finke, Messerly, et al., 1972, 2 | DH |
0.8820 | 206.19 | crystaline, I | liquid | Finke, Messerly, et al., 1972, 2 | DH |
Entropy of phase transition
ΔStrs (J/mol*K) | Temperature (K) | Initial Phase | Final Phase | Reference | Comment |
---|---|---|---|---|---|
1.24 | 91.30 | crystaline, III | crystaline, II | Finke, Messerly, et al., 1972, 2 | DH |
29.91 | 202.27 | crystaline, II | crystaline, I | Finke, Messerly, et al., 1972, 2 | DH |
4.28 | 206.19 | crystaline, I | liquid | Finke, Messerly, et al., 1972, 2 | DH |

Reaction thermochemistry data

Data compiled by: Michael M. Meot-Ner (Mautner) and Sharon G. Lias
Individual Reactions
By formula: C3H9Si+ + C4H11N = (C3H9Si+ • C4H11N)
Quantity | Value | Units | Method | Reference | Comment |
---|---|---|---|---|---|
ΔrH° | 243. | kJ/mol | PHPMS | Li and Stone, 1990 | gas phase; switching reaction,Thermochemical ladder((CH3)3Si+)C6H5COOC2H5; Wojtyniak and Stone, 1986 |
Quantity | Value | Units | Method | Reference | Comment |
ΔrS° | 174. | J/mol*K | PHPMS | Li and Stone, 1990 | gas phase; switching reaction,Thermochemical ladder((CH3)3Si+)C6H5COOC2H5; Wojtyniak and Stone, 1986 |

Gas phase ion energetics data

Data evaluated as indicated in comments:
HL - Edward P. Hunter and Sharon G. Lias
Data compiled as indicated in comments:
LLK - Sharon G. Lias, Rhoda D. Levin, and Sherif A. Kafafi
RDSH - Henry M. Rosenstock, Keith Draxl, Bruce W. Steiner, and John T. Herron
Quantity | Value | Units | Method | Reference | Comment |
---|---|---|---|---|---|
Proton affinity (review) | 934.1 | kJ/mol | N/A | Hunter and Lias, 1998 | HL |
Quantity | Value | Units | Method | Reference | Comment |
Gas basicity | 899.9 | kJ/mol | N/A | Hunter and Lias, 1998 | HL |
Ionization energy determinations
IE (eV) | Method | Reference | Comment |
---|---|---|---|
8.5 ± 0.1 | PE | Aue, Webb, et al., 1976 | LLK |
8.83 | PE | Al-Joboury and Turner, 1964 | RDSH |
8.64 | PI | Watanabe, Nakayama, et al., 1962 | RDSH |
Appearance energy determinations
Ion | AE (eV) | Other Products | Method | Reference | Comment |
---|---|---|---|---|---|
C3H8N+ | 8.89 | CH3 | EI | Lossing, Lam, et al., 1981 | LLK |

Ion clustering data

Data compiled by: Michael M. Meot-Ner (Mautner) and Sharon G. Lias
Clustering reactions
By formula: C3H9Si+ + C4H11N = (C3H9Si+ • C4H11N)
Quantity | Value | Units | Method | Reference | Comment |
---|---|---|---|---|---|
ΔrH° | 243. | kJ/mol | PHPMS | Li and Stone, 1990 | gas phase; switching reaction,Thermochemical ladder((CH3)3Si+)C6H5COOC2H5; Wojtyniak and Stone, 1986 |
Quantity | Value | Units | Method | Reference | Comment |
ΔrS° | 174. | J/mol*K | PHPMS | Li and Stone, 1990 | gas phase; switching reaction,Thermochemical ladder((CH3)3Si+)C6H5COOC2H5; Wojtyniak and Stone, 1986 |

Kovats' RI, non-polar column, isothermal

Column type | Active phase | Temperature (C) | I | Reference | Comment |
---|---|---|---|---|---|
Packed | OV-101 | 130. | 501. | Osmialowski, Halkiewicz, et al., 1985 | Ar, Chromosorb W HP; Column length: 1. m |
Packed | PMS-100 | 130. | 438. | Anderson, Jurel, et al., 1973 | He, Celite 545 (44-60 mesh); Column length: 3. m |
Packed | PMS-100 | 150. | 435. | Anderson, Jurel, et al., 1973 | He, Celite 545 (44-60 mesh); Column length: 3. m |
Packed | PMS-100 | 180. | 432. | Anderson, Jurel, et al., 1973 | He, Celite 545 (44-60 mesh); Column length: 3. m |
Packed | Squalane | 50. | 484. | Vernon, 1971 | N2 |

Kovats' RI, polar column, isothermal

Column type | Active phase | Temperature (C) | I | Reference | Comment |
---|---|---|---|---|---|
Packed | PEG-2000 | 120. | 716. | Anderson, Jurel, et al., 1973 | He, Celite 545 (44-60 mesh); Column length: 3. m |
Packed | PEG-2000 | 150. | 712. | Anderson, Jurel, et al., 1973 | He, Celite 545 (44-60 mesh); Column length: 3. m |
Packed | PEG-2000 | 152. | 725. | Anderson, Jurel, et al., 1973 | He, Celite 545 (44-60 mesh); Column length: 3. m |
Packed | PEG-2000 | 179. | 715. | Anderson, Jurel, et al., 1973 | He, Celite 545 (44-60 mesh); Column length: 3. m |
Packed | PEG-2000 | 180. | 712. | Anderson, Jurel, et al., 1973 | He, Celite 545 (44-60 mesh); Column length: 3. m |

Normal alkane RI, non-polar column, isothermal

Column type | Active phase | Temperature (C) | I | Reference | Comment |
---|---|---|---|---|---|
Capillary | OV-101 | 130. | 501. | Qi, Yang, et al., 2000 | |
Packed | Squalane | 100. | 480. | Vernon, 1971 | N2 |

Normal alkane RI, polar column, custom temperature program

Column type | Active phase | I | Reference | Comment |
---|---|---|---|---|
Capillary | DB-Wax | 729. | Peng, Yang, et al., 1991 | Program: not specified |

Gas phase thermochemistry data

Data compiled as indicated in comments:
ALS - Hussein Y. Afeefy, Joel F. Liebman, and Stephen E. Stein
DRB - Donald R. Burgess, Jr.
Quantity | Value | Units | Method | Reference | Comment |
---|---|---|---|---|---|
ΔfH°gas | -120. ± 0.8 | kJ/mol | Cm | Scott, 1971 | ALS |
ΔfH°gas | -120.9 ± 0.63 | kJ/mol | Ccr | Smith and Good, 1967 | ALS |
ΔfH°gas | -120.3 | kJ/mol | N/A | Evans, Fairbrother, et al., 1959 | Value computed using ΔfHliquid° value of -150.0±1.0 kj/mol from Evans, Fairbrother, et al., 1959 and ΔvapH° value of 29.7 kj/mol from Smith and Good, 1967.; DRB |
ΔfH°gas | -139.3 | kJ/mol | N/A | Lemoult, 1907 | Value computed using ΔfHliquid° value of -169.0 kj/mol from Lemoult, 1907 and ΔvapH° value of 29.7 kj/mol from Smith and Good, 1967.; DRB |

Condensed phase thermochemistry data

Data compiled as indicated in comments:
ALS - Hussein Y. Afeefy, Joel F. Liebman, and Stephen E. Stein
DH - Eugene S. Domalski and Elizabeth D. Hearing
Quantity | Value | Units | Method | Reference | Comment |
---|---|---|---|---|---|
ΔfH°liquid | -36.00 ± 0.12 | kcal/mol | Ccr | Smith and Good, 1967 | ALS |
ΔfH°liquid | -36.0 ± 0.3 | kcal/mol | Ccb | Evans, Fairbrother, et al., 1959 | ALS |
ΔfH°liquid | -40.4 | kcal/mol | Ccb | Lemoult, 1907 | ALS |
Quantity | Value | Units | Method | Reference | Comment |
ΔcH°liquid | -715.94 ± 0.10 | kcal/mol | Ccr | Smith and Good, 1967 | ALS |
ΔcH°liquid | -716.01 ± 0.27 | kcal/mol | Ccb | Evans, Fairbrother, et al., 1959 | ALS |
ΔcH°liquid | -716.3 | kcal/mol | Ccb | Lemoult, 1907 | ALS |
Quantity | Value | Units | Method | Reference | Comment |
S°liquid | 55.839 | cal/mol*K | N/A | Finke, Messerly, et al., 1972 | DH |
Constant pressure heat capacity of liquid
Cp,liquid (cal/mol*K) | Temperature (K) | Reference | Comment |
---|---|---|---|
45.820 | 298.15 | Finke, Messerly, et al., 1972 | T = 12 to 350 K.; DH |
45.4 | 298.15 | Konicek and Wadso, 1971 | DH |
45.89 | 298.15 | Smith and Good, 1967 | DH |

References

Timmermans and Mattaar, 1921
Timmermans, J.; Mattaar, J.F.,
Freezing points of orgainic substances VI. New experimental determinations.,
Bull. Soc. Chim. Belg., 1921, 30, 213. [all data]
Finke, Messerly, et al., 1972
Finke, H.L.; Messerly, J.F.; Todd, S.S.,
Thermodynamic properties of acrylonitrile, 1-aminopropane, 2-aminopropane, and 2-methyl-2-aminopropane,
J. Chem. Thermodyn., 1972, 4, 359. [all data]
Anonymous, 1964
Anonymous, R.,
, Natl. Bur. Stand. (U. S.), Tech. News Bull. 48, 1964. [all data]
Kobe and Mathews, 1970
Kobe, K.A.; Mathews, J.F.,
Critical Properties and Vapor Pressures of Some Organic Nitrogen and Oxygen Compounds,
J. Chem. Eng. Data, 1970, 15, 182. [all data]
Majer and Svoboda, 1985
Majer, V.; Svoboda, V.,
Enthalpies of Vaporization of Organic Compounds: A Critical Review and Data Compilation, Blackwell Scientific Publications, Oxford, 1985, 300. [all data]
Stephenson and Malanowski, 1987
Stephenson, Richard M.; Malanowski, Stanislaw,
Handbook of the Thermodynamics of Organic Compounds, 1987, https://doi.org/10.1007/978-94-009-3173-2
. [all data]
Osborn and Douslin, 1968
Osborn, Ann G.; Douslin, Donald R.,
Vapor pressure relations of 13 nitrogen compounds related to petroleum,
J. Chem. Eng. Data, 1968, 13, 4, 534-537, https://doi.org/10.1021/je60039a024
. [all data]
Domalski and Hearing, 1996
Domalski, Eugene S.; Hearing, Elizabeth D.,
Heat Capacities and Entropies of Organic Compounds in the Condensed Phase. Volume III,
J. Phys. Chem. Ref. Data, 1996, 25, 1, 1, https://doi.org/10.1063/1.555985
. [all data]
Finke, Messerly, et al., 1972, 2
Finke, H.L.; Messerly, J.F.; Todd, S.S.,
Thermodynamic properties of acrylonitrile, 1-aminopropane, 2-aminopropane, and 2-methyl-2-aminopropane,
J. Chem. Thermodynam., 1972, 4, 359-374. [all data]
Li and Stone, 1990
Li, X.; Stone, A.J.,
Gas-Phase (CH3)3Si+ Affinities of Alkylamines and Proton Affinities of Trimethylsilyl Alkylamines,
Int. J. Mass Spectrom. Ion Proc., 1990, 101, 2-3, 149, https://doi.org/10.1016/0168-1176(90)87008-5
. [all data]
Wojtyniak and Stone, 1986
Wojtyniak, A.C.M.; Stone, A.J.,
A High-Pressure Mass Spectrometric Study of the Bonding of Trimethylsilylium to Oxygen and Aromatic Bases,
Can. J. Chem., 1986, 74, 59. [all data]
Hunter and Lias, 1998
Hunter, E.P.; Lias, S.G.,
Evaluated Gas Phase Basicities and Proton Affinities of Molecules: An Update,
J. Phys. Chem. Ref. Data, 1998, 27, 3, 413-656, https://doi.org/10.1063/1.556018
. [all data]
Aue, Webb, et al., 1976
Aue, D.H.; Webb, H.M.; Bowers, M.T.,
Quantitative proton affinities, ionization potentials, and hydrogen affinities of alkylamines,
J. Am. Chem. Soc., 1976, 98, 311. [all data]
Al-Joboury and Turner, 1964
Al-Joboury, M.I.; Turner, D.W.,
Molecular photoelectron spectroscopy. Part II. A summary of ionization potentials,
J. Chem. Soc., 1964, 4434. [all data]
Watanabe, Nakayama, et al., 1962
Watanabe, K.; Nakayama, T.; Mottl, J.,
Ionization potentials of some molecules,
J. Quant. Spectry. Radiative Transfer, 1962, 2, 369. [all data]
Lossing, Lam, et al., 1981
Lossing, F.P.; Lam, Y.-T.; Maccoll, A.,
Gas phase heats of formation of alkyl immonium ions,
Can. J. Chem., 1981, 59, 2228. [all data]