Methane, bromotrichloro-
- Formula: CBrCl3
- Molecular weight: 198.274
- IUPAC Standard InChIKey: XNNQFQFUQLJSQT-UHFFFAOYSA-N
- CAS Registry Number: 75-62-7
- Chemical structure:
View 3d structure (requires JavaScript / HTML 5) - Other names: Bromotrichloromethane; Carbon bromotrichloride; Monobromotrichloromethane; Trichlorobromomethane; CCl3Br; Carbon trichlorobromide; Trichloromethyl bromide

Gas phase thermochemistry data

Data compiled by: Hussein Y. Afeefy, Joel F. Liebman, and Stephen E. Stein
Quantity | Value | Units | Method | Reference | Comment |
---|---|---|---|---|---|
ΔfH°gas | -42. ± 1. | kJ/mol | Eqk | Mendenhall, Golden, et al., 1973 | see Benson, 1965 |
ΔfH°gas | -39. | kJ/mol | Kin | Sullivan and Davidson, 1951 |

Condensed phase thermochemistry data

Data compiled by: Eugene S. Domalski and Elizabeth D. Hearing
Constant pressure heat capacity of liquid
Cp,liquid (J/mol*K) | Temperature (K) | Reference | Comment |
---|---|---|---|
149.4 | 298. | Bengough and Thomson, 1959 | Mean value 25 to 50°C. |

Phase change data

Data compiled as indicated in comments:
TRC - Thermodynamics Research Center, NIST Boulder Laboratories, Chris Muzny director
AC - William E. Acree, Jr., James S. Chickos
CAL - James S. Chickos, William E. Acree, Jr., Joel F. Liebman, Students of Chem 202 (Introduction to the Literature of Chemistry), University of Missouri -- St. Louis
Quantity | Value | Units | Method | Reference | Comment |
---|---|---|---|---|---|
Tboil | 376.65 | K | N/A | Zakharkin, 1952 | Uncertainty assigned by TRC = 2. K; TRC |
Quantity | Value | Units | Method | Reference | Comment |
Tfus | 268. | K | N/A | Dreisbach, 1955 | Uncertainty assigned by TRC = 0.02 K; TRC |
Enthalpy of vaporization
ΔvapH (kJ/mol) | Temperature (K) | Method | Reference | Comment |
---|---|---|---|---|
35.0 | 288. | N/A | Kudchadker, Kudchadker, et al., 1979 | Based on data from 273. to 387. K.; AC |
36.1 | 309. | A | Dykyj, 1970 | Based on data from 294. to 443. K. See also Stephenson and Malanowski, 1987.; AC |
Enthalpy of fusion
ΔfusH (kJ/mol) | Temperature (K) | Method | Reference | Comment |
---|---|---|---|---|
2.54 | 267.5 | AC | Acree, 1991 | See also Ohta, Yamamuro, et al., 1995.; AC |
Entropy of fusion
ΔfusS (J/mol*K) | Temperature (K) | Reference | Comment |
---|---|---|---|
19.4 | 238.2 | Cypcar, Johnson, et al., 1995 | CAL |
2.03 | 259.3 | ||
7.58 | 267.9 |

Reaction thermochemistry data

Data compiled by: Hussein Y. Afeefy, Joel F. Liebman, and Stephen E. Stein
Individual Reactions
By formula: CHCl3 + Br2 = HBr + CBrCl3
Quantity | Value | Units | Method | Reference | Comment |
---|---|---|---|---|---|
ΔrH° | -5.9 ± 0.4 | kJ/mol | Eqk | Mendenhall, Golden, et al., 1973 | gas phase |
By formula: CCl4 + Br2 = BrCl + CBrCl3
Quantity | Value | Units | Method | Reference | Comment |
---|---|---|---|---|---|
ΔrH° | 37. ± 1. | kJ/mol | Eqk | Mendenhall, Golden, et al., 1973 | gas phase |
By formula: HBr + CBrCl3 = CHCl3 + Br2
Quantity | Value | Units | Method | Reference | Comment |
---|---|---|---|---|---|
ΔrH° | 5.9 | kJ/mol | Kin | Sullivan and Davidson, 1951 | gas phase |

Gas phase ion energetics data

Data compiled as indicated in comments:
LBLHLM - Sharon G. Lias, John E. Bartmess, Joel F. Liebman, John L. Holmes, Rhoda D. Levin, and W. Gary Mallard
LLK - Sharon G. Lias, Rhoda D. Levin, and Sherif A. Kafafi
RDSH - Henry M. Rosenstock, Keith Draxl, Bruce W. Steiner, and John T. Herron
Ionization energy determinations
IE (eV) | Method | Reference | Comment |
---|---|---|---|
11.05 ± 0.02 | PI | Wang and Leroi, 1983 | LBLHLM |
10.6 | PE | Novak, Cvitas, et al., 1981 | LLK |
10.91 | PE | Novak, Cvitas, et al., 1981 | Vertical value; LLK |
Appearance energy determinations
Ion | AE (eV) | Other Products | Method | Reference | Comment |
---|---|---|---|---|---|
CCl3+ | 10.9 ± 0.1 | Br | EI | Farmer, Henderson, et al., 1956 | RDSH |

Kovats' RI, non-polar column, isothermal

Column type | Active phase | Temperature (C) | I | Reference | Comment |
---|---|---|---|---|---|
Packed | OV-1 | 100. | 762. | Castello and Gerbino, 1988 | He, Chromosorb W DMCS; Column length: 3. m |
Packed | OV-1 | 125. | 772. | Castello and Gerbino, 1988 | He, Chromosorb W DMCS; Column length: 3. m |
Packed | OV-1 | 75. | 754. | Castello and Gerbino, 1988 | He, Chromosorb W DMCS; Column length: 3. m |

Kovats' RI, polar column, isothermal

Column type | Active phase | Temperature (C) | I | Reference | Comment |
---|---|---|---|---|---|
Packed | SP-1000 | 100. | 1087.48 | Castello and Gerbino, 1988 | He, Chromosorb W DMCS; Column length: 3. m |
Packed | SP-1000 | 125. | 1101.23 | Castello and Gerbino, 1988 | He, Chromosorb W DMCS; Column length: 3. m |
Packed | SP-1000 | 75. | 1075.59 | Castello and Gerbino, 1988 | He, Chromosorb W DMCS; Column length: 3. m |

Normal alkane RI, non-polar column, custom temperature program

Column type | Active phase | I | Reference | Comment |
---|---|---|---|---|
Capillary | Methyl Silicone | 750. | Zenkevich, 2001 | Program: not specified |
Capillary | Methyl Silicone | 757. | Zenkevich, 2001 | Program: not specified |

Normal alkane RI, polar column, custom temperature program

Column type | Active phase | I | Reference | Comment |
---|---|---|---|---|
Capillary | Carbowax 20M | 1070. | Ramsey and Flanagan, 1982 | Program: not specified |

Vibrational and/or electronic energy levels

Data compiled by: Takehiko Shimanouchi

Symmetry:   C     Symmetry Number σ = 3

 Sym.   No   Approximate   Selected Freq.  Infrared   Raman   Comments
 Species   type of mode   Value   Rating   Value  Phase  Value  Phase

a1 1 CCl3 s-str 716  C 719 VS liq. 716.3 p liq.
a1 2 CBr str 422  C 420 W liq. 422.3 p liq.
a1 3 CCl3 s-deform 247  C 247.3 p liq.
e 4 CCl3 d-str 775  C 773 VS liq. 775.3 dp liq.
e 5 CBr bend 295  C 294 W liq. 295.0 dp liq.
e 6 CCl3 d-deform 193  C 193.3 dp liq.

Source: Shimanouchi, 1972

References

Mendenhall, Golden, et al., 1973
Mendenhall, G.D.; Golden, D.M.; Benson, S.W.,
Thermochemistry of the bromination of carbon tetrachloride and the heat of formation of carbon tetrachloride,
J. Phys. Chem., 1973, 77, 2707-2709. [all data]
Benson, 1965
Benson, S.W.,
Thermochemistry of the bromination of chloroform and the heat of formation of the CCl3 radical,
J. Chem. Phys., 1965, 43, 2044-2046. [all data]
Sullivan and Davidson, 1951
Sullivan, J.H.; Davidson, N.,
The kinetics of the forward and reverse reactions for the vapor phase thermal bromination of chloroform,
J. Chem. Phys., 1951, 19, 143-148. [all data]
Bengough and Thomson, 1959
Bengough, W.I.; Thomson, R.A.M.,
A dilatometric method of measuring the heats of radiation-induced reactions. Part 2.- The heat of photochemical addition of bromotrichloromethane to vinyl acetate,
Trans. Faraday Soc., 1959, 55, 268-271. [all data]
Zakharkin, 1952
Zakharkin, L.I.,
Bromotrichloromethane,
Sint. Org. Soedin., 1950-52, 1952, 2, 18. [all data]
Dreisbach, 1955
Dreisbach, R.R.,
Physical Properties of Chemical Compounds, Advances in Chemistry Series No. 15, Am. Chem. Soc.: Washington, D. C., 1955. [all data]
Kudchadker, Kudchadker, et al., 1979
Kudchadker, A.P.; Kudchadker, S.A.; Shukla, R.P.; Patnaik, P.R.,
Vapor pressures and boiling points of selected halomethanes,
J. Phys. Chem. Ref. Data, 1979, 8, 2, 499, https://doi.org/10.1063/1.555600
. [all data]
Dykyj, 1970
Dykyj, J.,
Petrochemica, 1970, 10, 2, 51. [all data]
Stephenson and Malanowski, 1987
Stephenson, Richard M.; Malanowski, Stanislaw,
Handbook of the Thermodynamics of Organic Compounds, 1987, https://doi.org/10.1007/978-94-009-3173-2
. [all data]
Acree, 1991
Acree, William E.,
Thermodynamic properties of organic compounds: enthalpy of fusion and melting point temperature compilation,
Thermochimica Acta, 1991, 189, 1, 37-56, https://doi.org/10.1016/0040-6031(91)87098-H
. [all data]
Ohta, Yamamuro, et al., 1995
Ohta, Tomoko; Yamamuro, Osamu; Matsuo, Takasuke,
Heat Capacities and Phase Transitions of CBrCl3 and CBr2Cl2,
J. Phys. Chem., 1995, 99, 8, 2403-2407, https://doi.org/10.1021/j100008a024
. [all data]
Cypcar, Johnson, et al., 1995
Cypcar, C.C.; Johnson, G.; Mathias, L.J.,
Molecular motions in low molar-mass alkyl amides: models for thermal transitions in polyamides,
Polym. Prepr. (Am. Chem. Soc. Div. Polym. Chem.), 1995, 36, 2, 402. [all data]
Wang and Leroi, 1983
Wang, F.C.-Y.; Leroi, G.E.,
Photoionization and fragmentation of halogenated methanes,
Ann. Isr. Phys. Soc., 1983, 6, 210. [all data]
Novak, Cvitas, et al., 1981
Novak, I.; Cvitas, T.; Klasinc, L.; Gusten, H.,
Photoelectron spectra of some halogenomethanes,
J. Chem. Soc. Faraday Trans. 2, 1981, 77, 2049. [all data]
Farmer, Henderson, et al., 1956
Farmer, J.B.; Henderson, I.H.S.; Lossing, F.P.; Marsden, D.G.H.,
Free radicals by mass spectrometry. IX. Ionization potentials of CF3 and CCl3 radicals and bond dissociation energies in some derivatives,
J. Chem. Phys., 1956, 24, 348. [all data]