Propylene oxide
- Formula: C3H6O
- Molecular weight: 58.0791
- IUPAC Standard InChIKey: GOOHAUXETOMSMM-UHFFFAOYSA-N
- CAS Registry Number: 75-56-9
- Chemical structure:
View 3d structure (requires JavaScript / HTML 5) - Stereoisomers:
- Other names: Oxirane, methyl-; Epoxypropane; Methyloxirane; Propane, 1,2-epoxy-; Propene oxide; Propylene epoxide; 1,2-Epoxypropane; 1,2-Propylene oxide; 2,3-Epoxypropane; 3-Methyl-1,2-epoxypropane; 2-Methyloxiran; Methylethylene oxide; AD 6; Ethylene oxide, methyl-; NCI-C50099; Oxyde de propylene; Propane, epoxy-; UN 1280; 2-Methyl oxirane; Epihydrin; (.+/-.)-Methyloxirane; AD 6 (suspending agent); Methyloxacyclopropane; Oxirane, 2-methyl-; (.+/-.)-1,2-Epoxypropane

Gas phase thermochemistry data

Data compiled as indicated in comments:
ALS - Hussein Y. Afeefy, Joel F. Liebman, and Stephen E. Stein
DRB - Donald R. Burgess, Jr.
GT - Glushko Thermocenter, Russian Academy of Sciences, Moscow
Quantity | Value | Units | Method | Reference | Comment |
---|---|---|---|---|---|
ΔfH°gas | -94.68 ± 0.63 | kJ/mol | Ccb | Sinke and Hildenbrand, 1962 | Reanalyzed by Cox and Pilcher, 1970, Original value = -92.8 ± 1.1 kJ/mol; ALS |
ΔfH°gas | -117.1 | kJ/mol | N/A | Moureu and Dode, 1937 | Value computed using ΔfHliquid° value of -145.0 kj/mol from Moureu and Dode, 1937 and ΔvapH° value of 27.9 kj/mol from Sinke and Hildenbrand, 1962.; DRB |
Quantity | Value | Units | Method | Reference | Comment |
S°gas | 287.40 ± 0.84 | J/mol*K | N/A | Oetting F.L., 1964 | Other values of third-law entropy at 298.15 K are (in J/mol*K): 285.3(8.4) [ Beaumont R.H., 1966] and 288.4(0.8) [ Chao J., 1986].; GT |
Constant pressure heat capacity of gas
Cp,gas (J/mol*K) | Temperature (K) | Reference | Comment |
---|---|---|---|
39.74 | 100. | Chao J., 1986 | Selected thermodynamic functions are in close agreement with those calculated by [ Oetting F.L., 1964]. Entropy values calculated by [ Green, 1961] are lower than those given here by 6 J/mol*K.; GT |
46.65 | 150. | ||
54.27 | 200. | ||
67.57 | 273.15 | ||
72.55 ± 0.12 | 298.15 | ||
72.92 | 300. | ||
92.99 | 400. | ||
110.99 | 500. | ||
126.16 | 600. | ||
138.89 | 700. | ||
149.68 | 800. | ||
158.91 | 900. | ||
166.85 | 1000. | ||
173.70 | 1100. | ||
179.62 | 1200. | ||
184.74 | 1300. | ||
189.19 | 1400. | ||
193.06 | 1500. | ||
200.70 | 1750. | ||
206.30 | 2000. | ||
210.40 | 2250. | ||
213.50 | 2500. | ||
215.90 | 2750. | ||
217.80 | 3000. |

Condensed phase thermochemistry data

Data compiled as indicated in comments:
ALS - Hussein Y. Afeefy, Joel F. Liebman, and Stephen E. Stein
DH - Eugene S. Domalski and Elizabeth D. Hearing
Quantity | Value | Units | Method | Reference | Comment |
---|---|---|---|---|---|
ΔfH°liquid | -122.6 ± 0.63 | kJ/mol | Ccb | Sinke and Hildenbrand, 1962 | Reanalyzed by Cox and Pilcher, 1970, Original value = -120.7 ± 1.1 kJ/mol; ALS |
ΔfH°liquid | -145. | kJ/mol | Ccb | Moureu and Dode, 1937 | ALS |
Quantity | Value | Units | Method | Reference | Comment |
ΔcH°liquid | -1917.4 ± 1.1 | kJ/mol | Ccb | Sinke and Hildenbrand, 1962 | Corresponding ΔfHºliquid = -120.6 kJ/mol (simple calculation by NIST; no Washburn corrections); ALS |
ΔcH°liquid | -1893. | kJ/mol | Ccb | Moureu and Dode, 1937 | Corresponding ΔfHºliquid = -145. kJ/mol (simple calculation by NIST; no Washburn corrections); ALS |
ΔcH°liquid | -1885. | kJ/mol | Ccb | Zubow and Swietoslawski, 1925 | Corresponding ΔfHºliquid = -153. kJ/mol (simple calculation by NIST; no Washburn corrections); ALS |
Quantity | Value | Units | Method | Reference | Comment |
S°liquid | 196.27 | J/mol*K | N/A | Oetting F.L., 1964 | DH |
S°liquid | 194.6 | J/mol*K | N/A | Beaumont, Clegg, et al., 1966 | Extrapolation below 90 K, 485 J/mol*K.; DH |
Constant pressure heat capacity of liquid
Cp,liquid (J/mol*K) | Temperature (K) | Reference | Comment |
---|---|---|---|
122.19 | 300. | Tan, Zhou, et al., 1982 | T = 170 to 325 K.; DH |
125.1 | 298.15 | Beaumont, Clegg, et al., 1966 | T = 90 to 300 K.; DH |

Phase change data

Data compiled as indicated in comments:
BS - Robert L. Brown and Stephen E. Stein
TRC - Thermodynamics Research Center, NIST Boulder Laboratories, Chris Muzny director
ALS - Hussein Y. Afeefy, Joel F. Liebman, and Stephen E. Stein
DRB - Donald R. Burgess, Jr.
AC - William E. Acree, Jr., James S. Chickos
DH - Eugene S. Domalski and Elizabeth D. Hearing
Quantity | Value | Units | Method | Reference | Comment |
---|---|---|---|---|---|
Tboil | 308.0 ± 0.3 | K | AVG | N/A | Average of 6 values; Individual data points |
Quantity | Value | Units | Method | Reference | Comment |
Tfus | 161.02 | K | N/A | McDonald, Shrader, et al., 1959 | Uncertainty assigned by TRC = 0.05 K; TRC |
Quantity | Value | Units | Method | Reference | Comment |
Ttriple | 161.22 | K | N/A | Wilhoit, Chao, et al., 1985 | Uncertainty assigned by TRC = 0.05 K; TRC |
Ttriple | 161.25 | K | N/A | Beaumont, Clegg, et al., 1966, 2 | Uncertainty assigned by TRC = 0.02 K; TRC |
Ttriple | 161.22 | K | N/A | Oetting, 1964 | Uncertainty assigned by TRC = 0.02 K; TRC |
Quantity | Value | Units | Method | Reference | Comment |
Tc | 488.2 | K | N/A | Rutenberg and Shakhova, 1973 | Uncertainty assigned by TRC = 5. K; Visual, Vp; TRC |
Tc | 482.3 | K | N/A | Kobe, Ravicz, et al., 1956 | Uncertainty assigned by TRC = 1. K; TRC |
Quantity | Value | Units | Method | Reference | Comment |
Pc | 54.40 | bar | N/A | Rutenberg and Shakhova, 1973 | Uncertainty assigned by TRC = 1.0132 bar; TRC |
Pc | 49.2284 | bar | N/A | Kobe, Ravicz, et al., 1956 | Uncertainty assigned by TRC = 0.3447 bar; TRC |
Quantity | Value | Units | Method | Reference | Comment |
Vc | 0.195 | l/mol | N/A | Rutenberg and Shakhova, 1973 | Uncertainty assigned by TRC = 0.002 l/mol; TRC |
Vc | 0.186 | l/mol | N/A | Kobe, Ravicz, et al., 1956 | Uncertainty assigned by TRC = 0.005 l/mol; TRC |
Quantity | Value | Units | Method | Reference | Comment |
ρc | 5.15 | mol/l | N/A | Rutenberg and Shakhova, 1973 | Uncertainty assigned by TRC = 0.1 mol/l; TRC |
Quantity | Value | Units | Method | Reference | Comment |
ΔvapH° | 28.31 | kJ/mol | N/A | Majer and Svoboda, 1985 | |
ΔvapH° | 27.9 | kJ/mol | C | Sinke and Hildenbrand, 1962 | ALS |
ΔvapH° | 27.9 | kJ/mol | N/A | Sinke and Hildenbrand, 1962 | DRB |
ΔvapH° | 27.9 | kJ/mol | C | Sinke and Hildenbrand, 1962, 2 | AC |
Enthalpy of vaporization
ΔvapH (kJ/mol) | Temperature (K) | Method | Reference | Comment |
---|---|---|---|---|
27.35 | 307.7 | N/A | Majer and Svoboda, 1985 | |
31.6 | 240. | A | Stephenson and Malanowski, 1987 | Based on data from 225. to 308. K. See also Dykyj, 1970.; AC |
28.5 | 307. | N/A | Bott and Sadler, 1966 | Based on data from 292. to 345. K.; AC |
30.1 | 264. | N/A | McDonald, Shrader, et al., 1959, 2 | Based on data from 249. to 308. K.; AC |
28.2 | 303. | N/A | Moor, Kanep, et al., 1937 | Based on data from 285. to 322. K.; AC |
32.9 | 273. | N/A | Kireev and Popov, 1935 | Based on data from 243. to 306. K.; AC |
Antoine Equation Parameters
log10(P) = A − (B / (T + C))
P = vapor pressure (bar)
T = temperature (K)
View plot Requires a JavaScript / HTML 5 canvas capable browser.
Temperature (K) | A | B | C | Reference | Comment |
---|---|---|---|---|---|
292. to 345.0 | 3.55046 | 802.487 | -81.348 | Bott and Sadler, 1966, 2 | Coefficents calculated by NIST from author's data. |
199.70 to 307.38 | 4.09487 | 1065.27 | -46.867 | McDonald, Shrader, et al., 1959, 2 |
Enthalpy of fusion
ΔfusH (kJ/mol) | Temperature (K) | Reference | Comment |
---|---|---|---|
6.5329 | 161.22 | Oetting F.L., 1964 | DH |
6.57 | 161.3 | Domalski and Hearing, 1996 | AC |
6.569 | 161.25 | Beaumont, Clegg, et al., 1966 | DH |
Entropy of fusion
ΔfusS (J/mol*K) | Temperature (K) | Reference | Comment |
---|---|---|---|
40.52 | 161.22 | Oetting F.L., 1964 | DH |
40.74 | 161.25 | Beaumont, Clegg, et al., 1966 | DH |

Reaction thermochemistry data

Data compiled by: Hussein Y. Afeefy, Joel F. Liebman, and Stephen E. Stein
Individual Reactions
By formula: C3H6O = C3H6O
Quantity | Value | Units | Method | Reference | Comment |
---|---|---|---|---|---|
ΔrH° | -98.7 | kJ/mol | Eqk | Polkovnikova and Lapiclus, 1974 | gas phase; At 300 K |
By formula: C3H6O = C3H6O
Quantity | Value | Units | Method | Reference | Comment |
---|---|---|---|---|---|
ΔrH° | -124. | kJ/mol | Eqk | Polkovnikova and Lapiclus, 1974 | gas phase; At 300 K |

Henry's Law data

Data compiled by: Rolf Sander
Henry's Law constant (water solution)
kH(T) = k°H exp(d(ln(kH))/d(1/T) ((1/T) - 1/(298.15 K)))
k°H = Henry's law constant for solubility in water at 298.15 K (mol/(kg*bar))
d(ln(kH))/d(1/T) = Temperature dependence constant (K)
k°H (mol/(kg*bar)) | d(ln(kH))/d(1/T) (K) | Method | Reference |
---|---|---|---|
5.2 | 3500. | X | N/A |

Gas phase ion energetics data

Data evaluated as indicated in comments:
HL - Edward P. Hunter and Sharon G. Lias
L - Sharon G. Lias
Data compiled as indicated in comments:
LLK - Sharon G. Lias, Rhoda D. Levin, and Sherif A. Kafafi
RDSH - Henry M. Rosenstock, Keith Draxl, Bruce W. Steiner, and John T. Herron
LBLHLM - Sharon G. Lias, John E. Bartmess, Joel F. Liebman, John L. Holmes, Rhoda D. Levin, and W. Gary Mallard
Quantity | Value | Units | Method | Reference | Comment |
---|---|---|---|---|---|
IE (evaluated) | 10.22 ± 0.02 | eV | N/A | N/A | L |
Quantity | Value | Units | Method | Reference | Comment |
Proton affinity (review) | 803.3 | kJ/mol | N/A | Hunter and Lias, 1998 | HL |
Quantity | Value | Units | Method | Reference | Comment |
Gas basicity | 772.7 | kJ/mol | N/A | Hunter and Lias, 1998 | HL |
Ionization energy determinations
IE (eV) | Method | Reference | Comment |
---|---|---|---|
10.1 | PE | Aue and Bowers, 1979 | LLK |
10.22 ± 0.02 | PI | Watanabe, Nakayama, et al., 1962 | RDSH |
10.44 | PE | Kimura, Katsumata, et al., 1981 | Vertical value; LLK |
10.26 | PE | McAlduff and Houk, 1977 | Vertical value; LLK |
Appearance energy determinations
Ion | AE (eV) | Other Products | Method | Reference | Comment |
---|---|---|---|---|---|
CHO+ | 11.8 ± 0.2 | ? | EI | Gallegos and Kiser, 1961 | RDSH |
CH2+ | 18.8 ± 0.5 | ? | EI | Gallegos and Kiser, 1961 | RDSH |
CH2O+ | 11.6 ± 0.3 | C2H4 | EI | Gallegos and Kiser, 1961 | RDSH |
CH3+ | 13.9 ± 0.2 | ? | EI | Gallegos and Kiser, 1961 | RDSH |
CH3O+ | 13.4 ± 0.2 | ? | EI | Gallegos and Kiser, 1961 | RDSH |
C2H2+ | 13.9 ± 0.2 | ? | EI | Gallegos and Kiser, 1961 | RDSH |
C2H2O+ | 12.7 ± 0.2 | ? | EI | Gallegos and Kiser, 1961 | RDSH |
C2H3+ | 14.3 ± 0.1 | ? | EI | Gallegos and Kiser, 1961 | RDSH |
C2H3O+ | 10.72 ± 0.05 | CH3 | EI | Burgers and Holmes, 1982 | LBLHLM |
C2H3O+ | 10.9 ± 0.2 | CH3 | EI | Gallegos and Kiser, 1961 | RDSH |
C2H4+ | 11.6 ± 0.2 | ? | EI | Gallegos and Kiser, 1961 | RDSH |
C3H5O+ | 11.5 ± 0.3 | H | EI | Gallegos and Kiser, 1961 | RDSH |

Normal alkane RI, non-polar column, isothermal

Column type | Active phase | Temperature (C) | I | Reference | Comment |
---|---|---|---|---|---|
Capillary | Methyl Silicone | 60. | 447. | Cao and Zhang, 2006 | Column length: 50. m; Column diameter: 0.25 mm |
Capillary | Methyl Silicone | 70. | 447. | Cao and Zhang, 2006 | Column length: 50. m; Column diameter: 0.25 mm |
Capillary | Methyl Silicone | 80. | 448. | Cao and Zhang, 2006 | Column length: 50. m; Column diameter: 0.25 mm |
Packed | Apieson L | 120. | 460. | Kurdina, Markovich, et al., 1969 | not specified, not specified |

Normal alkane RI, non-polar column, custom temperature program

Column type | Active phase | I | Reference | Comment |
---|---|---|---|---|
Capillary | Methyl Silicone | 477. | Farkas, Héberger, et al., 2004 | Program: not specified |

References

Sinke and Hildenbrand, 1962
Sinke, G.C.; Hildenbrand, D.L.,
Heat of formation of propylene oxide,
J. Chem. Eng. Data, 1962, 7, 74. [all data]
Cox and Pilcher, 1970
Cox, J.D.; Pilcher, G.,
Thermochemistry of Organic and Organometallic Compounds, Academic Press, New York, 1970, 1-636. [all data]
Moureu and Dode, 1937
Moureu, H.; Dode, M.,
Chaleurs de formation de l'oxyde d'ethylene, de l'ethanediol et de quelques homologues,
Bull. Soc. Chim. France, 1937, 4, 637-647. [all data]
Oetting F.L., 1964
Oetting F.L.,
Low-temperature heat capacity and related thermodynamic functions of propylene oxide,
J. Chem. Phys., 1964, 41, 149-153. [all data]
Beaumont R.H., 1966
Beaumont R.H.,
Heat capacities of propylene oxide and some polymers of ethylene and propylene oxides,
Polymer, 1966, 7, 401-416. [all data]
Chao J., 1986
Chao J.,
Thermodynamic properties of key organic oxygen compounds in the carbon range C1 to C4. Part 2. Ideal gas properties,
J. Phys. Chem. Ref. Data, 1986, 15, 1369-1436. [all data]
Green, 1961
Green, J.H.S.,
The thermodynamic properties of propylene oxide,
Chem. Ind. (London), 1961, 369. [all data]
Zubow and Swietoslawski, 1925
Zubow, P.W.; Swietoslawski, W.,
No. 21. - Sur la chaleur de combustion de trois oxydes(α),
Bull. Soc. Chim. Fr., 1925, 37, 271-274. [all data]
Beaumont, Clegg, et al., 1966
Beaumont, R.H.; Clegg, B.; Gee, G.; Herbert, J.B.M.; Marks, D.J.; Roberts, R.C.; Sims, D.,
Heat capacities of propylene oxide and of some polymers of ethylene and propylene oxides,
Polymer, 1966, 7, 401-416. [all data]
Tan, Zhou, et al., 1982
Tan, Z.; Zhou, L.; Chen, S.; Yin, A.; Sun, Y.; Ye, J.,
An adiabatic calorimeter for heat capacity measurements of pure silver and propylene oxide from 80 to 400K,
Diwen Wuli, 1982, 4(4), 322-325. [all data]
McDonald, Shrader, et al., 1959
McDonald, R.A.; Shrader, S.A.; Stull, D.R.,
Vapor Pressures and Freezing Points of 30 Organics,
J. Chem. Eng. Data, 1959, 4, 311. [all data]
Wilhoit, Chao, et al., 1985
Wilhoit, R.C.; Chao, J.; Hall, K.R.,
Thermodynamic Properties of Key Organic Compounds in the Carbon Range C1 to C4. Part 1. Properties of Condensed Phases,
J. Phys. Chem. Ref. Data, 1985, 14, 1. [all data]
Beaumont, Clegg, et al., 1966, 2
Beaumont, R.H.; Clegg, B.; Gee, G.; Herbert, J.B.M.; Marks, D.J.; Roberts, R.C.; Sims, D.,
Heat Capacities of Propylene Oxide and of Some Polymers of Ethylene and Propylene Oxides,
Polymer, 1966, 7, 401. [all data]
Oetting, 1964
Oetting, F.L.,
Low temperature heat capacity and related thermodynamic functions of propylene oxide,
J. Chem. Phys., 1964, 41, 149-53. [all data]
Rutenberg and Shakhova, 1973
Rutenberg, O.L.; Shakhova, S.F.,
The p-v-t relation on the boundary curve for epoxypropane,
Russ. J. Phys. Chem. (Engl. Transl.), 1973, 47, 124-5. [all data]
Kobe, Ravicz, et al., 1956
Kobe, K.A.; Ravicz, A.E.; Vohra, S.P.,
Critical Properties and Vapor Pressures of Some Ethers and Heterocyclic Compounds,
J. Chem. Eng. Data, 1956, 1, 50. [all data]
Majer and Svoboda, 1985
Majer, V.; Svoboda, V.,
Enthalpies of Vaporization of Organic Compounds: A Critical Review and Data Compilation, Blackwell Scientific Publications, Oxford, 1985, 300. [all data]
Sinke and Hildenbrand, 1962, 2
Sinke, G.C.; Hildenbrand, D.L.,
Heat of Formation of Propylene Oxide.,
J. Chem. Eng. Data, 1962, 7, 1, 74-74, https://doi.org/10.1021/je60012a022
. [all data]
Stephenson and Malanowski, 1987
Stephenson, Richard M.; Malanowski, Stanislaw,
Handbook of the Thermodynamics of Organic Compounds, 1987, https://doi.org/10.1007/978-94-009-3173-2
. [all data]
Dykyj, 1970
Dykyj, J.,
Petrochemica, 1970, 10, 2, 51. [all data]
Bott and Sadler, 1966
Bott, T.R.; Sadler, H.N.,
Vapor Pressure of Propylene Oxide.,
J. Chem. Eng. Data, 1966, 11, 1, 25-25, https://doi.org/10.1021/je60028a005
. [all data]
McDonald, Shrader, et al., 1959, 2
McDonald, R.A.; Shrader, S.A.; Stull, D.R.,
Vapor Pressures and Freezing Points of Thirty Pure Organic Compounds.,
J. Chem. Eng. Data, 1959, 4, 4, 311-313, https://doi.org/10.1021/je60004a009
. [all data]
Moor, Kanep, et al., 1937
Moor, V.G.; Kanep, E.K.; Dobkin, I.E.,
Trans. Exptl. Research Lab. Khemgas, Materials on Cracking and Chemical Treatment of Cracking Products U.S.S.R., 1937, 3, 320. [all data]
Kireev and Popov, 1935
Kireev, V.A.; Popov, A.A.,
Russ. J. Gen. Chem., 1935, 5, 1399. [all data]
Bott and Sadler, 1966, 2
Bott, T.R.; Sadler, H.N.,
Vapor Pressure of Propylene Oxide,
J. Chem. Eng. Data, 1966, 11, 1, 25-30, https://doi.org/10.1021/je60028a005
. [all data]
Domalski and Hearing, 1996
Domalski, Eugene S.; Hearing, Elizabeth D.,
Heat Capacities and Entropies of Organic Compounds in the Condensed Phase. Volume III,
J. Phys. Chem. Ref. Data, 1996, 25, 1, 1, https://doi.org/10.1063/1.555985
. [all data]
Polkovnikova and Lapiclus, 1974
Polkovnikova, A.G.; Lapiclus, V.L.,
Calculation of the equilibrium and heat of isomerization of propylene oxide on a lithium phosphate catalyst,
Neftekhimiya, 1974, 14, 113-115. [all data]
Hunter and Lias, 1998
Hunter, E.P.; Lias, S.G.,
Evaluated Gas Phase Basicities and Proton Affinities of Molecules: An Update,
J. Phys. Chem. Ref. Data, 1998, 27, 3, 413-656, https://doi.org/10.1063/1.556018
. [all data]
Aue and Bowers, 1979
Aue, D.H.; Bowers, M.T.,
Chapter 9. Stabilities of positive ions from equilibrium gas phase basicity measurements
in Ions Chemistry,, ed. M.T. Bowers, 1979. [all data]
Watanabe, Nakayama, et al., 1962
Watanabe, K.; Nakayama, T.; Mottl, J.,
Ionization potentials of some molecules,
J. Quant. Spectry. Radiative Transfer, 1962, 2, 369. [all data]
Kimura, Katsumata, et al., 1981
Kimura, K.; Katsumata, S.; Achiba, Y.; Yamazaki, T.; Iwata, S.,
Ionization energies, Ab initio assignments, and valence electronic structure for 200 molecules
in Handbook of HeI Photoelectron Spectra of Fundamental Organic Compounds, Japan Scientific Soc. Press, Tokyo, 1981. [all data]
McAlduff and Houk, 1977
McAlduff, E.J.; Houk, K.N.,
Photoelectron spectra of substituted oxiranes and thiiranes. Substituent effects on ionization potentials involving σ orbitals,
Can. J. Chem., 1977, 55, 318. [all data]
Gallegos and Kiser, 1961
Gallegos, E.J.; Kiser, R.W.,
Electron impact spectroscopy of ethylene oxide and propylene oxide,
J. Am. Chem. Soc., 1961, 83, 773. [all data]
Burgers and Holmes, 1982
Burgers, P.C.; Holmes, J.L.,
Metastable ion studies. XIII. The measurement of appearance energies of metastable peaks,
Org. Mass Spectrom., 1982, 17, 123. [all data]
Cao and Zhang, 2006
Cao, J.; Zhang, H.,
Inquire into qualitative analysis of epoxyalkyl isomeride,
Contemporary Chem. Ind. (Chinese), 2006, 35, 5, 374-377. [all data]
Kurdina, Markovich, et al., 1969
Kurdina, Z.G.; Markovich, V.E.; Sakharov, V.M.,
Gas chromatography of cyclic O-containing compounds
in Gas chromatography, Issue # 10, NIITEKhim, Moscow, 1969, 128-133. [all data]
Farkas, Héberger, et al., 2004
Farkas, O.; Héberger, K.; Zenkevich, I.G.,
Quantitative structure-retention relationships. XIV. Prediction of gas chromatographic retention indices for saturated O-, N-, and S-heterocyclic compounds,
Chemom. Intell. Lab. Syst., 2004, 72, 2, 173-184, https://doi.org/10.1016/j.chemolab.2004.01.012
. [all data]