Lithium bromide
- Formula: BrLi
- Molecular weight: 86.845
- IUPAC Standard InChIKey: AMXOYNBUYSYVKV-UHFFFAOYSA-M
- CAS Registry Number: 7550-35-8
- Chemical structure:
View 3d structure (requires JavaScript / HTML 5) - Permanent link for this species. Use this link for bookmarking this species for future reference.

Condensed phase thermochemistry data

Quantity | Value | Units | Method | Reference | Comment |
---|---|---|---|---|---|
ΔfH°liquid | -338.23 | kJ/mol | Review | Chase, 1998 | Data last reviewed in June, 1966 |
Quantity | Value | Units | Method | Reference | Comment |
S°liquid,1 bar | 84.60 | J/mol*K | Review | Chase, 1998 | Data last reviewed in June, 1966 |
Quantity | Value | Units | Method | Reference | Comment |
ΔfH°solid | -350.91 | kJ/mol | Review | Chase, 1998 | Data last reviewed in June, 1966 |
Quantity | Value | Units | Method | Reference | Comment |
S°solid | 74.04 | J/mol*K | Review | Chase, 1998 | Data last reviewed in June, 1966 |
Liquid Phase Heat Capacity (Shomate Equation)
Cp° = A + B*t + C*t2 + D*t3 +
E/t2
H° − H°298.15= A*t + B*t2/2 +
C*t3/3 + D*t4/4 − E/t + F − H
S° = A*ln(t) + B*t + C*t2/2 + D*t3/3 −
E/(2*t2) + G
Cp = heat capacity (J/mol*K)
H° = standard enthalpy (kJ/mol)
S° = standard entropy (J/mol*K)
t = temperature (K) / 1000.
View plot Requires a JavaScript / HTML 5 canvas capable browser.
Temperature (K) | 823. to 2000. |
---|---|
A | 65.26998 |
B | 1.710215×10-9 |
C | -1.312539×10-9 |
D | 3.215501×10-10 |
E | 3.014573×10-11 |
F | -357.6864 |
G | 163.5911 |
H | -338.2262 |
Reference | Chase, 1998 |
Comment | Data last reviewed in June, 1966 |
Solid Phase Heat Capacity (Shomate Equation)
Cp° = A + B*t + C*t2 + D*t3 +
E/t2
H° − H°298.15= A*t + B*t2/2 +
C*t3/3 + D*t4/4 − E/t + F − H
S° = A*ln(t) + B*t + C*t2/2 + D*t3/3 −
E/(2*t2) + G
Cp = heat capacity (J/mol*K)
H° = standard enthalpy (kJ/mol)
S° = standard entropy (J/mol*K)
t = temperature (K) / 1000.
View plot Requires a JavaScript / HTML 5 canvas capable browser.
Temperature (K) | 298. to 823. |
---|---|
A | 71.38155 |
B | -81.89008 |
C | 118.8879 |
D | -32.37918 |
E | -0.689063 |
F | -371.8563 |
G | 175.9673 |
H | -350.9125 |
Reference | Chase, 1998 |
Comment | Data last reviewed in June, 1966 |

Reaction thermochemistry data

Data compiled as indicated in comments:
MS - José A. Martinho Simões
ALS - Hussein Y. Afeefy, Joel F. Liebman, and Stephen E. Stein
Individual Reactions
C4H9Li (l) + (g) =
(l) +
(cr)
By formula: C4H9Li (l) + HBr (g) = C4H10 (l) + BrLi (cr)
Quantity | Value | Units | Method | Reference | Comment |
---|---|---|---|---|---|
ΔrH° | -374.0 ± 2.0 | kJ/mol | RSC | Holm, 1974 | Please also see Pedley and Rylance, 1977. The reaction enthalpy was quoted from Pedley and Rylance, 1977. See Liebman, Martinho Simões, et al., 1995 for comments; MS |
By formula: HBr (g) + CH3Li (cr) = CH4 (g) + BrLi (cr)
Quantity | Value | Units | Method | Reference | Comment |
---|---|---|---|---|---|
ΔrH° | -317.3 ± 2.0 | kJ/mol | RSC | Holm, 1974 | Please also see Pedley and Rylance, 1977. The reaction enthalpy was quoted from Pedley and Rylance, 1977. See Liebman, Martinho Simões, et al., 1995 for comments; MS |
By formula: HBr (g) + C2H5Li (cr) = C2H6 (g) + BrLi (cr)
Quantity | Value | Units | Method | Reference | Comment |
---|---|---|---|---|---|
ΔrH° | -345.7 ± 2.0 | kJ/mol | RSC | Holm, 1974 | Please also see Pedley and Rylance, 1977. The reaction enthalpy was quoted from Pedley and Rylance, 1977. See Liebman, Martinho Simões, et al., 1995 for comments; MS |
(g) + C4H9Li (l) =
(l) +
(cr)
By formula: HBr (g) + C4H9Li (l) = C4H10 (l) + BrLi (cr)
Quantity | Value | Units | Method | Reference | Comment |
---|---|---|---|---|---|
ΔrH° | -352.7 ± 2.0 | kJ/mol | RSC | Holm, 1974 | Please also see Pedley and Rylance, 1977. The reaction enthalpy was quoted from Pedley and Rylance, 1977. See Liebman, Martinho Simões, et al., 1995 for comments; MS |
+ C4H9Li =
+
By formula: C7H7Br + C4H9Li = C11H16 + BrLi
Quantity | Value | Units | Method | Reference | Comment |
---|---|---|---|---|---|
ΔrH° | -338. ± 11. | kJ/mol | Cm | Fowell and Mortimer, 1961 | liquid phase; ALS |

Gas phase ion energetics data

Data evaluated as indicated in comments:
HL - Edward P. Hunter and Sharon G. Lias
Data compiled as indicated in comments:
LLK - Sharon G. Lias, Rhoda D. Levin, and Sherif A. Kafafi
RDSH - Henry M. Rosenstock, Keith Draxl, Bruce W. Steiner, and John T. Herron
B - John E. Bartmess
Quantity | Value | Units | Method | Reference | Comment |
---|---|---|---|---|---|
Proton affinity (review) | 819. | kJ/mol | N/A | Hunter and Lias, 1998 | HL |
Quantity | Value | Units | Method | Reference | Comment |
Gas basicity | 792.5 | kJ/mol | N/A | Hunter and Lias, 1998 | HL |
Electron affinity determinations
EA (eV) | Reference | Comment |
---|---|---|
0.660 ± 0.040 | Miller, Leopold, et al., 1986 | Extrapolated by polarizability and radius from experimental data.; B |
Ionization energy determinations
IE (eV) | Method | Reference | Comment |
---|---|---|---|
9.3 | EI | Bloom and Williams, 1981 | LLK |
8.7 | PE | Potts and Lee, 1979 | LLK |
9.4 | EI | Berkowitz, Tasman, et al., 1962 | RDSH |
9.43 ± 0.05 | PE | Potts and Lee, 1979 | Vertical value; LLK |
10.0 | PE | Goodman, Allen, et al., 1974 | Vertical value; LLK |
Appearance energy determinations
Ion | AE (eV) | Other Products | Method | Reference | Comment |
---|---|---|---|---|---|
Li+ | 9.9 | Br | EI | Berkowitz, Tasman, et al., 1962 | RDSH |

Gas phase thermochemistry data

Quantity | Value | Units | Method | Reference | Comment |
---|---|---|---|---|---|
ΔfH°gas | -153.97 | kJ/mol | Review | Chase, 1998 | Data last reviewed in June, 1966 |
Quantity | Value | Units | Method | Reference | Comment |
S°gas,1 bar | 224.33 | J/mol*K | Review | Chase, 1998 | Data last reviewed in June, 1966 |
Gas Phase Heat Capacity (Shomate Equation)
Cp° = A + B*t + C*t2 + D*t3 +
E/t2
H° − H°298.15= A*t + B*t2/2 +
C*t3/3 + D*t4/4 − E/t + F − H
S° = A*ln(t) + B*t + C*t2/2 + D*t3/3 −
E/(2*t2) + G
Cp = heat capacity (J/mol*K)
H° = standard enthalpy (kJ/mol)
S° = standard entropy (J/mol*K)
t = temperature (K) / 1000.
View plot Requires a JavaScript / HTML 5 canvas capable browser.
Temperature (K) | 2000. to 6000. |
---|---|
A | 36.87263 |
B | 1.099125 |
C | -0.124519 |
D | 0.010609 |
E | -0.295577 |
F | -166.0035 |
G | 266.9626 |
H | -153.9712 |
Reference | Chase, 1998 |
Comment | Data last reviewed in June, 1966 |

Phase change data

Antoine Equation Parameters
log10(P) = A − (B / (T + C))
P = vapor pressure (bar)
T = temperature (K)
View plot Requires a JavaScript / HTML 5 canvas capable browser.
Temperature (K) | A | B | C | Reference | Comment |
---|---|---|---|---|---|
1021. to 1583. | 4.72068 | 6978.079 | -102.451 | Stull, 1947 | Coefficents calculated by NIST from author's data. |

References

Chase, 1998
Chase, M.W., Jr.,
NIST-JANAF Themochemical Tables, Fourth Edition,
J. Phys. Chem. Ref. Data, Monograph 9, 1998, 1-1951. [all data]
Holm, 1974
Holm, T.,
J. Organometal. Chem., 1974, 77, 27. [all data]
Pedley and Rylance, 1977
Pedley, J.B.; Rylance, J.,
Computer Analysed Thermochemical Data: Organic and Organometallic Compounds, University of Sussex, Brigton, 1977. [all data]
Liebman, Martinho Simões, et al., 1995
Liebman, J.F.; Martinho Simões, J.A.; Slayden, S.W.,
In Lithium Chemistry: A Theoretical and Experimental Overview Wiley: New York, Sapse, A.-M.; Schleyer, P. von Ragué, ed(s)., 1995. [all data]
Fowell and Mortimer, 1961
Fowell, P.A.; Mortimer, C.T.,
735. Heats of formation and bond energies. Part V. n-Butyl-lithium,
J. Chem. Soc., 1961, 3793-3796. [all data]
Hunter and Lias, 1998
Hunter, E.P.; Lias, S.G.,
Evaluated Gas Phase Basicities and Proton Affinities of Molecules: An Update,
J. Phys. Chem. Ref. Data, 1998, 27, 3, 413-656, https://doi.org/10.1063/1.556018
. [all data]
Miller, Leopold, et al., 1986
Miller, T.M.; Leopold, D.G.; Murray, K.K.; Lineberger, W.C.,
Electron Affinities of the Alkali Halides and the Structure of their Negative Ions,
J. Chem. Phys., 1986, 85, 5, 2368, https://doi.org/10.1063/1.451091
. [all data]
Bloom and Williams, 1981
Bloom, H.; Williams, D.J.,
A mass spectrometric study of the vapors above the molten salt systems LiCl-CuCl, LiBr-CuBr, and NaI-CuI,
J. Chem. Phys., 1981, 75, 4636. [all data]
Potts and Lee, 1979
Potts, A.W.; Lee, E.P.F.,
Photoelectron spectra and electronic structure of lithium halide monomers and dimers,
J. Chem. Soc. Faraday Trans. 2, 1979, 75, 941. [all data]
Berkowitz, Tasman, et al., 1962
Berkowitz, J.; Tasman, H.A.; Chupka, W.A.,
Double-oven experiments with lithium halide vapors,
J. Chem. Phys., 1962, 36, 2170. [all data]
Goodman, Allen, et al., 1974
Goodman, T.D.; Allen, J.D., Jr.; Cusachs, L.C.; Schweitzer, G.K.,
The photoelectron spectra of gaseous alkali halides,
J. Electron Spectrosc. Relat. Phenom., 1974, 3, 289. [all data]