Fluoroform
- Formula: CHF3
- Molecular weight: 70.0138
- IUPAC Standard InChIKey: XPDWGBQVDMORPB-UHFFFAOYSA-N
- CAS Registry Number: 75-46-7
- Chemical structure:
View 3d structure (requires JavaScript / HTML 5) - Other names: Methane, trifluoro-; Arcton 1; Fluoryl; Freon F-23; Freon 23; Genetron 23; Methyl trifluoride; R 23; Trifluoromethane; CHF3; Arcton; Halocarbon 23; UN 1984; Carbon trifluoride; Genetron HFC23; Propellant 23; Refrigerant 23; FC 23 (fluorocarbon); FC 23; R 23 (halocarbon); HFC 23

Gas phase thermochemistry data

Data compiled as indicated in comments:
ALS - Hussein Y. Afeefy, Joel F. Liebman, and Stephen E. Stein
Quantity | Value | Units | Method | Reference | Comment |
---|---|---|---|---|---|
ΔfH°gas | -697.05 | kJ/mol | Review | Chase, 1998 | Data last reviewed in June, 1969 |
ΔfH°gas | -690.8 | kJ/mol | Eqk | Goy, Lord, et al., 1967 | ALS |
ΔfH°gas | -695.4 ± 2.7 | kJ/mol | Ccr | Neugebauer and Margrave, 1957 | Reanalyzed by Cox and Pilcher, 1970, Original value = -680.3 ± 2.7 kJ/mol; ALS |
Quantity | Value | Units | Method | Reference | Comment |
ΔcH°gas | -71.55 ± 0.71 | kJ/mol | Eqk | Goy, Lord, et al., 1967 | ALS |
ΔcH°gas | -516.3 | kJ/mol | Ccr | Neugebauer and Margrave, 1957 | ALS |
Quantity | Value | Units | Method | Reference | Comment |
S°gas,1 bar | 259.65 | J/mol*K | Review | Chase, 1998 | Data last reviewed in June, 1969 |
Gas Phase Heat Capacity (Shomate Equation)
Cp° = A + B*t + C*t2 + D*t3 +
E/t2
H° − H°298.15= A*t + B*t2/2 +
C*t3/3 + D*t4/4 − E/t + F − H
S° = A*ln(t) + B*t + C*t2/2 + D*t3/3 −
E/(2*t2) + G
Cp = heat capacity (J/mol*K)
H° = standard enthalpy (kJ/mol)
S° = standard entropy (J/mol*K)
t = temperature (K) / 1000.
View plot Requires a JavaScript / HTML 5 canvas capable browser.
Temperature (K) | 298. to 1200. | 1200. to 6000. |
---|---|---|
A | 6.463694 | 100.5352 |
B | 185.4332 | 3.936630 |
C | -140.8870 | -0.757020 |
D | 39.84921 | 0.050454 |
E | 0.064514 | -13.51683 |
F | -705.8450 | -759.4546 |
G | 218.4579 | 336.4170 |
H | -697.0544 | -697.0544 |
Reference | Chase, 1998 | Chase, 1998 |
Comment | Data last reviewed in June, 1969 | Data last reviewed in June, 1969 |

Condensed phase thermochemistry data

Data compiled by: Eugene S. Domalski and Elizabeth D. Hearing
Quantity | Value | Units | Method | Reference | Comment |
---|---|---|---|---|---|
S°liquid | 151.04 | J/mol*K | N/A | Valentine, Brodale, et al., 1962 |
Constant pressure heat capacity of liquid
Cp,liquid (J/mol*K) | Temperature (K) | Reference | Comment |
---|---|---|---|
86.44 | 190.97 | Valentine, Brodale, et al., 1962 | T = 15 to 190.97 K. |

Phase change data

Data compiled as indicated in comments:
BS - Robert L. Brown and Stephen E. Stein
TRC - Thermodynamics Research Center, NIST Boulder Laboratories, Chris Muzny director
DH - Eugene S. Domalski and Elizabeth D. Hearing
AC - William E. Acree, Jr., James S. Chickos
Quantity | Value | Units | Method | Reference | Comment |
---|---|---|---|---|---|
Tboil | 188.7 | K | N/A | PCR Inc., 1990 | BS |
Tboil | 191.0 | K | N/A | Streng, 1971 | Uncertainty assigned by TRC = 0.05 K; TRC |
Tboil | 189. | K | N/A | Croll and Scott, 1964 | Uncertainty assigned by TRC = 0.3 K; TRC |
Tboil | 189. | K | N/A | Thorp and Scott, 1956 | Uncertainty assigned by TRC = 0.5 K; TRC |
Quantity | Value | Units | Method | Reference | Comment |
Tfus | 110.2 | K | N/A | Streng, 1971 | Uncertainty assigned by TRC = 0.2 K; TRC |
Tfus | 117.97 | K | N/A | Valentine, Brodale, et al., 1962, 2 | Uncertainty assigned by TRC = 0.05 K; TRC |
Tfus | 113. | K | N/A | Thorp and Scott, 1956 | Uncertainty assigned by TRC = 0.5 K; TRC |
Quantity | Value | Units | Method | Reference | Comment |
Ttriple | 117.97 | K | N/A | Valentine, Brodale, et al., 1962, 2 | Uncertainty assigned by TRC = 0.02 K; TRC |
Quantity | Value | Units | Method | Reference | Comment |
Tc | 299.1 ± 0.3 | K | AVG | N/A | Average of 7 values; Individual data points |
Quantity | Value | Units | Method | Reference | Comment |
Pc | 48.28 | bar | N/A | Ohgaki, Umezono, et al., 1990 | Uncertainty assigned by TRC = 0.25 bar; TRC |
Pc | 48.162 | bar | N/A | Hori, Okazaki, et al., 1982 | Uncertainty assigned by TRC = 0.02 bar; TRC |
Pc | 50.3585 | bar | N/A | Wagner, 1968 | Uncertainty assigned by TRC = 0.1013 bar; TRC |
Pc | 48.3612 | bar | N/A | Hou and Martin, 1959 | Uncertainty assigned by TRC = 0.0689 bar; TRC |
Quantity | Value | Units | Method | Reference | Comment |
ρc | 7.5 ± 0.1 | mol/l | AVG | N/A | Average of 6 values; Individual data points |
Enthalpy of vaporization
ΔvapH (kJ/mol) | Temperature (K) | Method | Reference | Comment |
---|---|---|---|---|
16.711 | 190.97 | N/A | Valentine, Brodale, et al., 1962 | P = 101.325 kPa.; DH |
18.1 | 175. | A | Stephenson and Malanowski, 1987 | Based on data from 138. to 190. K.; AC |
16.8 | 213. | A | Stephenson and Malanowski, 1987 | Based on data from 198. to 298. K.; AC |
18.0 | 177. | N/A | Valentine, Brodale, et al., 1962 | Based on data from 146. to 192. K.; AC |
Entropy of vaporization
ΔvapS (J/mol*K) | Temperature (K) | Reference | Comment |
---|---|---|---|
87.50 | 190.97 | Valentine, Brodale, et al., 1962 | P; DH |
Antoine Equation Parameters
log10(P) = A − (B / (T + C))
P = vapor pressure (bar)
T = temperature (K)
View plot Requires a JavaScript / HTML 5 canvas capable browser.
Temperature (K) | A | B | C | Reference | Comment |
---|---|---|---|---|---|
145.36 to 191.19 | 4.25548 | 718.089 | -22.013 | Valentine, Brodale, et al., 1962 | Coefficents calculated by NIST from author's data. |
Enthalpy of sublimation
ΔsubH (kJ/mol) | Temperature (K) | Reference | Comment |
---|---|---|---|
25.6 | 103. | Stephenson and Malanowski, 1987 | Based on data from 89. to 118. K.; AC |
Enthalpy of fusion
ΔfusH (kJ/mol) | Temperature (K) | Reference | Comment |
---|---|---|---|
4.058 | 117.97 | Valentine, Brodale, et al., 1962 | DH |
4.06 | 118. | Domalski and Hearing, 1996 | AC |
Entropy of fusion
ΔfusS (J/mol*K) | Temperature (K) | Reference | Comment |
---|---|---|---|
34.40 | 117.97 | Valentine, Brodale, et al., 1962 | DH |

Reaction thermochemistry data

Data compiled as indicated in comments:
B - John E. Bartmess
M - Michael M. Meot-Ner (Mautner) and Sharon G. Lias
MS - José A. Martinho Simões
ALS - Hussein Y. Afeefy, Joel F. Liebman, and Stephen E. Stein
Individual Reactions
CF3- + =
Quantity | Value | Units | Method | Reference | Comment |
---|---|---|---|---|---|
ΔrH° | 1582. ± 5.9 | kJ/mol | D-EA | Deyerl, Alconcel, et al., 2001 | gas phase; Adiabatic EA, from vibrational structure of spectrum; B |
ΔrH° | 1577. ± 8.8 | kJ/mol | G+TS | Bartmess, Scott, et al., 1979 | gas phase; Paulino and Squires, 1991 suggests that this acidity may be too weak by ca. 5 kcal/mol. However, G2 calcn(JEB) give ΔHacid=379.9, ΔGacid=372.0; value altered from reference due to change in acidity scale; B |
ΔrH° | 1573. ± 19. | kJ/mol | CIDT | Graul and Squires, 1990 | gas phase; B |
Quantity | Value | Units | Method | Reference | Comment |
ΔrG° | 1549. ± 6.3 | kJ/mol | H-TS | Deyerl, Alconcel, et al., 2001 | gas phase; Adiabatic EA, from vibrational structure of spectrum; B |
ΔrG° | 1545. ± 8.4 | kJ/mol | IMRE | Bartmess, Scott, et al., 1979 | gas phase; Paulino and Squires, 1991 suggests that this acidity may be too weak by ca. 5 kcal/mol. However, G2 calcn(JEB) give ΔHacid=379.9, ΔGacid=372.0; value altered from reference due to change in acidity scale; B |
By formula: CN- + CHF3 = (CN- • CHF3)
Quantity | Value | Units | Method | Reference | Comment |
---|---|---|---|---|---|
ΔrH° | 71. ± 15. | kJ/mol | IMRE | Larson and McMahon, 1987 | gas phase; B,M |
Quantity | Value | Units | Method | Reference | Comment |
ΔrS° | 102. | J/mol*K | N/A | Larson and McMahon, 1987 | gas phase; switching reaction,Thermochemical ladder(CN-)H2O, Entropy change calculated or estimated; Payzant, Yamdagni, et al., 1971; M |
Quantity | Value | Units | Method | Reference | Comment |
ΔrG° | 40. ± 9.6 | kJ/mol | IMRE | Larson and McMahon, 1987 | gas phase; B,M |
By formula: Cl- + CHF3 = (Cl- • CHF3)
Quantity | Value | Units | Method | Reference | Comment |
---|---|---|---|---|---|
ΔrH° | 70. ± 10. | kJ/mol | IMRE | Larson and McMahon, 1984 | gas phase; B,M |
Quantity | Value | Units | Method | Reference | Comment |
ΔrS° | 95.8 | J/mol*K | N/A | Larson and McMahon, 1984, 2 | gas phase; switching reaction(Cl-)t-C4H9OH, Entropy change calculated or estimated; French, Ikuta, et al., 1982; M |
Quantity | Value | Units | Method | Reference | Comment |
ΔrG° | 41. ± 8.4 | kJ/mol | IMRE | Larson and McMahon, 1984 | gas phase; B,M |
By formula: F- + CHF3 = (F- • CHF3)
Quantity | Value | Units | Method | Reference | Comment |
---|---|---|---|---|---|
ΔrH° | 113. ± 8.4 | kJ/mol | IMRE | Larson and McMahon, 1983 | gas phase; B,M |
Quantity | Value | Units | Method | Reference | Comment |
ΔrS° | 105. | J/mol*K | N/A | Larson and McMahon, 1983 | gas phase; switching reaction(F-)H2O, Entropy change calculated or estimated; Arshadi, Yamdagni, et al., 1970; M |
Quantity | Value | Units | Method | Reference | Comment |
ΔrG° | 82.0 ± 8.4 | kJ/mol | IMRE | Larson and McMahon, 1983 | gas phase; B,M |
By formula: C8H5- + CHF3 = C9H6F3-
Quantity | Value | Units | Method | Reference | Comment |
---|---|---|---|---|---|
ΔrH° | 80.8 ± 4.2 | kJ/mol | IMRE | Chabinyc and Brauman, 2000 | gas phase; Original dG=8.8 at 350K; dS based on symmetry alone; B |
Quantity | Value | Units | Method | Reference | Comment |
ΔrG° | 43.5 ± 4.2 | kJ/mol | IMRE | Chabinyc and Brauman, 2000 | gas phase; Original dG=8.8 at 350K; dS based on symmetry alone; B |
By formula: C2H- + CHF3 = C3H2F3-
Quantity | Value | Units | Method | Reference | Comment |
---|---|---|---|---|---|
ΔrH° | 80.8 ± 4.2 | kJ/mol | IMRE | Chabinyc and Brauman, 2000 | gas phase; Original dG=9.2 at 350K; dS based on symmetry alone; B |
Quantity | Value | Units | Method | Reference | Comment |
ΔrG° | 44.8 ± 4.2 | kJ/mol | IMRE | Chabinyc and Brauman, 2000 | gas phase; Original dG=9.2 at 350K; dS based on symmetry alone; B |
By formula: C9H7- + CHF3 = C10H8F3-
Quantity | Value | Units | Method | Reference | Comment |
---|---|---|---|---|---|
ΔrH° | 78.7 ± 4.2 | kJ/mol | IMRE | Chabinyc and Brauman, 2000 | gas phase; Original dG=8.3 at 350K; dS based on symmetry alone; B |
Quantity | Value | Units | Method | Reference | Comment |
ΔrG° | 41. ± 4.2 | kJ/mol | IMRE | Chabinyc and Brauman, 2000 | gas phase; Original dG=8.3 at 350K; dS based on symmetry alone; B |
By formula: C2H5O- + CHF3 = C3H6F3O-
Quantity | Value | Units | Method | Reference | Comment |
---|---|---|---|---|---|
ΔrH° | 92.0 ± 4.2 | kJ/mol | IMRE | Chabinyc and Brauman, 1998 | gas phase; B |
Quantity | Value | Units | Method | Reference | Comment |
ΔrG° | 63.2 ± 4.2 | kJ/mol | IMRE | Chabinyc and Brauman, 1998 | gas phase; B |
By formula: CH3O- + CHF3 = C2H4F3O-
Quantity | Value | Units | Method | Reference | Comment |
---|---|---|---|---|---|
ΔrH° | 98.3 ± 4.2 | kJ/mol | IMRE | Chabinyc and Brauman, 1998 | gas phase; B |
Quantity | Value | Units | Method | Reference | Comment |
ΔrG° | 69.5 ± 4.2 | kJ/mol | IMRE | Chabinyc and Brauman, 1998 | gas phase; B |
By formula: C3H7O- + CHF3 = C4H8F3O-
Quantity | Value | Units | Method | Reference | Comment |
---|---|---|---|---|---|
ΔrH° | 88.3 ± 4.2 | kJ/mol | IMRE | Chabinyc and Brauman, 1998 | gas phase; B |
Quantity | Value | Units | Method | Reference | Comment |
ΔrG° | 59.4 ± 4.2 | kJ/mol | IMRE | Chabinyc and Brauman, 1998 | gas phase; B |
By formula: C4H9+ + CHF3 = (C4H9+ • CHF3)
Quantity | Value | Units | Method | Reference | Comment |
---|---|---|---|---|---|
ΔrH° | 28. | kJ/mol | PHPMS | Sharma, Meza de Hojer, et al., 1985 | gas phase; M |
Quantity | Value | Units | Method | Reference | Comment |
ΔrS° | 82.8 | J/mol*K | PHPMS | Sharma, Meza de Hojer, et al., 1985 | gas phase; M |
C5O5W (g) + (g) = C6HF3O5W (g)
By formula: C5O5W (g) + CHF3 (g) = C6HF3O5W (g)
Quantity | Value | Units | Method | Reference | Comment |
---|---|---|---|---|---|
ΔrH° | <-20.9 | kJ/mol | EqG | Brown, Ishikawa, et al., 1990 | Temperature range: ca. 300-350 K; MS |
By formula: I- + CHF3 = (I- • CHF3)
Quantity | Value | Units | Method | Reference | Comment |
---|---|---|---|---|---|
ΔrH° | 54.0 ± 4.2 | kJ/mol | TDAs | Caldwell, Masucci, et al., 1989 | gas phase; B,M |
By formula: CHF3 + Br2 = HBr + CBrF3
Quantity | Value | Units | Method | Reference | Comment |
---|---|---|---|---|---|
ΔrH° | -14. | kJ/mol | Eqk | Corbett, Tarr, et al., 1963 | gas phase; At 298 K; ALS |
By formula: HBr + CBrF3 = CHF3 + Br2
Quantity | Value | Units | Method | Reference | Comment |
---|---|---|---|---|---|
ΔrH° | 19.2 ± 1.0 | kJ/mol | Eqk | Coomber and Whittle, 1967 | gas phase; ALS |
By formula: 2CHClF2 = CHCl2F + CHF3
Quantity | Value | Units | Method | Reference | Comment |
---|---|---|---|---|---|
ΔrH° | -14.2 ± 2.0 | kJ/mol | Eqk | Hess and Kemnitz, 1992 | gas phase; ALS |

Henry's Law data

Data compiled by: Rolf Sander
Henry's Law constant (water solution)
kH(T) = k°H exp(d(ln(kH))/d(1/T) ((1/T) - 1/(298.15 K)))
k°H = Henry's law constant for solubility in water at 298.15 K (mol/(kg*bar))
d(ln(kH))/d(1/T) = Temperature dependence constant (K)
k°H (mol/(kg*bar)) | d(ln(kH))/d(1/T) (K) | Method | Reference | Comment |
---|---|---|---|---|
0.013 | Q | N/A | missing citation give several references for the Henry's law constants but don't assign them to specific species. | |
0.013 | 3200. | L | N/A | |
0.011 | V | N/A |

Gas phase ion energetics data

Data evaluated as indicated in comments:
HL - Edward P. Hunter and Sharon G. Lias
L - Sharon G. Lias
Data compiled as indicated in comments:
B - John E. Bartmess
LBLHLM - Sharon G. Lias, John E. Bartmess, Joel F. Liebman, John L. Holmes, Rhoda D. Levin, and W. Gary Mallard
LLK - Sharon G. Lias, Rhoda D. Levin, and Sherif A. Kafafi
RDSH - Henry M. Rosenstock, Keith Draxl, Bruce W. Steiner, and John T. Herron
LL - Sharon G. Lias and Joel F. Liebman
Quantity | Value | Units | Method | Reference | Comment |
---|---|---|---|---|---|
IE (evaluated) | 13.86 | eV | N/A | N/A | L |
Quantity | Value | Units | Method | Reference | Comment |
Proton affinity (review) | 619.5 | kJ/mol | N/A | Hunter and Lias, 1998 | HL |
Quantity | Value | Units | Method | Reference | Comment |
Gas basicity | 589.7 | kJ/mol | N/A | Hunter and Lias, 1998 | HL |
Ionization energy determinations
IE (eV) | Method | Reference | Comment |
---|---|---|---|
13.9 | PE | Novak, Potts, et al., 1985 | LBLHLM |
14.19 ± 0.02 | PI | Wang and Leroi, 1983 | LBLHLM |
13.86 | PE | Pullen, Carlson, et al., 1970 | RDSH |
≥13.8 | PE | Brundle, Robin, et al., 1970 | RDSH |
~13.84 | S | Stokes and Duncan, 1958 | RDSH |
15.5 | PE | Bock, Wittmann, et al., 1982 | Vertical value; LBLHLM |
14.8 | PE | Bieri, Asbrink, et al., 1981 | Vertical value; LLK |
14.8 ± 0.05 | PE | Demuth, 1977 | Vertical value; LLK |
14.80 | EI | Harshbarger, Robin, et al., 1973 | Vertical value; LLK |
Appearance energy determinations
Ion | AE (eV) | Other Products | Method | Reference | Comment |
---|---|---|---|---|---|
CF+ | 20.9 | HF+F | EI | Goto, Nakamura, et al., 1994 | LL |
CF+ | 20.2 ± 0.4 | ? | EI | Hobrock and Kiser, 1964 | RDSH |
CF2+ | 17.6 | HF | EI | Goto, Nakamura, et al., 1994 | LL |
CF2+ | 14.7 ± 0.4 | ? | EI | Steele, 1964 | RDSH |
CF3+ | 15.2 | H | EI | Goto, Nakamura, et al., 1994 | LL |
CF3+ | 14.14 | H | PI | Noutary, 1968 | RDSH |
CF3+ | 14.03 ± 0.06 | H | EI | Martin, Lampe, et al., 1966 | RDSH |
CH+ | 33.5 | F2+F | EI | Goto, Nakamura, et al., 1994 | LL |
CHF+ | 19.8 | F2 | EI | Goto, Nakamura, et al., 1994 | LL |
CHF2+ | 16.8 | F | EI | Goto, Nakamura, et al., 1994 | LL |
CHF2+ | 15.75 | F | EI | Lifshitz and Long, 1965 | RDSH |
CHF2+ | 16.4 ± 0.3 | F | EI | Hobrock and Kiser, 1964 | RDSH |
F+ | 37.0 | ? | EI | Goto, Nakamura, et al., 1994 | LL |
De-protonation reactions
CF3- + =
Quantity | Value | Units | Method | Reference | Comment |
---|---|---|---|---|---|
ΔrH° | 1582. ± 5.9 | kJ/mol | D-EA | Deyerl, Alconcel, et al., 2001 | gas phase; Adiabatic EA, from vibrational structure of spectrum; B |
ΔrH° | 1577. ± 8.8 | kJ/mol | G+TS | Bartmess, Scott, et al., 1979 | gas phase; Paulino and Squires, 1991 suggests that this acidity may be too weak by ca. 5 kcal/mol. However, G2 calcn(JEB) give ΔHacid=379.9, ΔGacid=372.0; value altered from reference due to change in acidity scale; B |
ΔrH° | 1573. ± 19. | kJ/mol | CIDT | Graul and Squires, 1990 | gas phase; B |
Quantity | Value | Units | Method | Reference | Comment |
ΔrG° | 1549. ± 6.3 | kJ/mol | H-TS | Deyerl, Alconcel, et al., 2001 | gas phase; Adiabatic EA, from vibrational structure of spectrum; B |
ΔrG° | 1545. ± 8.4 | kJ/mol | IMRE | Bartmess, Scott, et al., 1979 | gas phase; Paulino and Squires, 1991 suggests that this acidity may be too weak by ca. 5 kcal/mol. However, G2 calcn(JEB) give ΔHacid=379.9, ΔGacid=372.0; value altered from reference due to change in acidity scale; B |

Ion clustering data

Data compiled as indicated in comments:
B - John E. Bartmess
M - Michael M. Meot-Ner (Mautner) and Sharon G. Lias
Clustering reactions
By formula: CH3O- + CHF3 = C2H4F3O-
Quantity | Value | Units | Method | Reference | Comment |
---|---|---|---|---|---|
ΔrH° | 98.3 ± 4.2 | kJ/mol | IMRE | Chabinyc and Brauman, 1998 | gas phase; B |
Quantity | Value | Units | Method | Reference | Comment |
ΔrG° | 69.5 ± 4.2 | kJ/mol | IMRE | Chabinyc and Brauman, 1998 | gas phase; B |
By formula: CN- + CHF3 = (CN- • CHF3)
Quantity | Value | Units | Method | Reference | Comment |
---|---|---|---|---|---|
ΔrH° | 71. ± 15. | kJ/mol | IMRE | Larson and McMahon, 1987 | gas phase; B,M |
Quantity | Value | Units | Method | Reference | Comment |
ΔrS° | 102. | J/mol*K | N/A | Larson and McMahon, 1987 | gas phase; switching reaction,Thermochemical ladder(CN-)H2O, Entropy change calculated or estimated; Payzant, Yamdagni, et al., 1971; M |
Quantity | Value | Units | Method | Reference | Comment |
ΔrG° | 40. ± 9.6 | kJ/mol | IMRE | Larson and McMahon, 1987 | gas phase; B,M |
By formula: C2H- + CHF3 = C3H2F3-
Quantity | Value | Units | Method | Reference | Comment |
---|---|---|---|---|---|
ΔrH° | 80.8 ± 4.2 | kJ/mol | IMRE | Chabinyc and Brauman, 2000 | gas phase; Original dG=9.2 at 350K; dS based on symmetry alone; B |
Quantity | Value | Units | Method | Reference | Comment |
ΔrG° | 44.8 ± 4.2 | kJ/mol | IMRE | Chabinyc and Brauman, 2000 | gas phase; Original dG=9.2 at 350K; dS based on symmetry alone; B |
By formula: C2H5O- + CHF3 = C3H6F3O-
Quantity | Value | Units | Method | Reference | Comment |
---|---|---|---|---|---|
ΔrH° | 92.0 ± 4.2 | kJ/mol | IMRE | Chabinyc and Brauman, 1998 | gas phase; B |
Quantity | Value | Units | Method | Reference | Comment |
ΔrG° | 63.2 ± 4.2 | kJ/mol | IMRE | Chabinyc and Brauman, 1998 | gas phase; B |
By formula: C3H7O- + CHF3 = C4H8F3O-
Quantity | Value | Units | Method | Reference | Comment |
---|---|---|---|---|---|
ΔrH° | 88.3 ± 4.2 | kJ/mol | IMRE | Chabinyc and Brauman, 1998 | gas phase; B |
Quantity | Value | Units | Method | Reference | Comment |
ΔrG° | 59.4 ± 4.2 | kJ/mol | IMRE | Chabinyc and Brauman, 1998 | gas phase; B |
By formula: C4H9+ + CHF3 = (C4H9+ • CHF3)
Quantity | Value | Units | Method | Reference | Comment |
---|---|---|---|---|---|
ΔrH° | 28. | kJ/mol | PHPMS | Sharma, Meza de Hojer, et al., 1985 | gas phase; M |
Quantity | Value | Units | Method | Reference | Comment |
ΔrS° | 82.8 | J/mol*K | PHPMS | Sharma, Meza de Hojer, et al., 1985 | gas phase; M |
By formula: C8H5- + CHF3 = C9H6F3-
Quantity | Value | Units | Method | Reference | Comment |
---|---|---|---|---|---|
ΔrH° | 80.8 ± 4.2 | kJ/mol | IMRE | Chabinyc and Brauman, 2000 | gas phase; Original dG=8.8 at 350K; dS based on symmetry alone; B |
Quantity | Value | Units | Method | Reference | Comment |
ΔrG° | 43.5 ± 4.2 | kJ/mol | IMRE | Chabinyc and Brauman, 2000 | gas phase; Original dG=8.8 at 350K; dS based on symmetry alone; B |
By formula: C9H7- + CHF3 = C10H8F3-
Quantity | Value | Units | Method | Reference | Comment |
---|---|---|---|---|---|
ΔrH° | 78.7 ± 4.2 | kJ/mol | IMRE | Chabinyc and Brauman, 2000 | gas phase; Original dG=8.3 at 350K; dS based on symmetry alone; B |
Quantity | Value | Units | Method | Reference | Comment |
ΔrG° | 41. ± 4.2 | kJ/mol | IMRE | Chabinyc and Brauman, 2000 | gas phase; Original dG=8.3 at 350K; dS based on symmetry alone; B |
By formula: Cl- + CHF3 = (Cl- • CHF3)
Quantity | Value | Units | Method | Reference | Comment |
---|---|---|---|---|---|
ΔrH° | 70. ± 10. | kJ/mol | IMRE | Larson and McMahon, 1984 | gas phase; B,M |
Quantity | Value | Units | Method | Reference | Comment |
ΔrS° | 95.8 | J/mol*K | N/A | Larson and McMahon, 1984, 2 | gas phase; switching reaction(Cl-)t-C4H9OH, Entropy change calculated or estimated; French, Ikuta, et al., 1982; M |
Quantity | Value | Units | Method | Reference | Comment |
ΔrG° | 41. ± 8.4 | kJ/mol | IMRE | Larson and McMahon, 1984 | gas phase; B,M |
By formula: F- + CHF3 = (F- • CHF3)
Quantity | Value | Units | Method | Reference | Comment |
---|---|---|---|---|---|
ΔrH° | 113. ± 8.4 | kJ/mol | IMRE | Larson and McMahon, 1983 | gas phase; B,M |
Quantity | Value | Units | Method | Reference | Comment |
ΔrS° | 105. | J/mol*K | N/A | Larson and McMahon, 1983 | gas phase; switching reaction(F-)H2O, Entropy change calculated or estimated; Arshadi, Yamdagni, et al., 1970; M |
Quantity | Value | Units | Method | Reference | Comment |
ΔrG° | 82.0 ± 8.4 | kJ/mol | IMRE | Larson and McMahon, 1983 | gas phase; B,M |
By formula: I- + CHF3 = (I- • CHF3)
Quantity | Value | Units | Method | Reference | Comment |
---|---|---|---|---|---|
ΔrH° | 54.0 ± 4.2 | kJ/mol | TDAs | Caldwell, Masucci, et al., 1989 | gas phase; B,M |

Normal alkane RI, non-polar column, temperature ramp

Column type | Active phase | I | Reference | Comment |
---|---|---|---|---|
Capillary | OV-101 | 202. | Zenkevich, 2005 | 25. m/0.20 mm/0.10 μm, N2/He, 6. K/min; Tstart: 50. C; Tend: 250. C |

Normal alkane RI, non-polar column, custom temperature program

Column type | Active phase | I | Reference | Comment |
---|---|---|---|---|
Capillary | Methyl Silicone | 202. | Zenkevich, 1996 | Program: not specified |

References

Chase, 1998
Chase, M.W., Jr.,
NIST-JANAF Themochemical Tables, Fourth Edition,
J. Phys. Chem. Ref. Data, Monograph 9, 1998, 1-1951. [all data]
Goy, Lord, et al., 1967
Goy, C.A.; Lord, A.; Pritchard, H.O.,
Kinetics and thermodynamics of the reaction between iodine and fluoroform and the heat of formation of trifluoromethyl iodide,
J. Phys. Chem., 1967, 71, 1086-1089. [all data]
Neugebauer and Margrave, 1957
Neugebauer, C.A.; Margrave, J.L.,
Heats of formation of the fluoromethanes and fluoroethylenes,
Tech. Rept., 1957, 1-45. [all data]
Cox and Pilcher, 1970
Cox, J.D.; Pilcher, G.,
Thermochemistry of Organic and Organometallic Compounds, Academic Press, New York, 1970, 1-636. [all data]
Valentine, Brodale, et al., 1962
Valentine, R.H.; Brodale, G.E.; Giauque, W.F.,
Trifluoromethane: entropy, low temperature heat capacity, heats of fusion and vaporization, and vapor pressure,
J. Phys. Chem., 1962, 66, 392-395. [all data]
PCR Inc., 1990
PCR Inc.,
Research Chemicals Catalog 1990-1991, PCR Inc., Gainesville, FL, 1990, 1. [all data]
Streng, 1971
Streng, A.G.,
Miscibility and Compatibility of Some Liquid and Solidified Gases at Low Temperature,
J. Chem. Eng. Data, 1971, 16, 357. [all data]
Croll and Scott, 1964
Croll, I.M.; Scott, R.L.,
Fluorocarbon Solutions at Low Termperatures IV. The Liquid Mixtures CH4 + CClF3, CH2F2 + CClF3, CHF3 + CClF3, CF4 + CClF3, C2H6 + CClF3, C2H6 + CF4, and CHF3 + CF4,
J. Phys. Chem., 1964, 68, 3853. [all data]
Thorp and Scott, 1956
Thorp, N.; Scott, R.L.,
Fluorocarbon solutions at low termperatures. I. The liquid mixtures CF4-CHF3, CF4-CH4, CF4-Kr, CH4-Kr.,
J. Phys. Chem., 1956, 60, 670. [all data]
Valentine, Brodale, et al., 1962, 2
Valentine, R.H.; Brodale, G.E.; Giauque, W.F.,
Trifluoromethane: entropy,low temp. heat capacity, heats of fusion and vaporization, and vapor pressure,
J. Phys. Chem., 1962, 66, 392. [all data]
Ohgaki, Umezono, et al., 1990
Ohgaki, K.; Umezono, S.; Katayama, T.,
Pressure-density-temperature (p-ρ-T) relations of fluoroform, nitrous oxide, and propene in the critical region,
J. Supercrit. Fluids, 1990, 3, 78-84. [all data]
Hori, Okazaki, et al., 1982
Hori, K.; Okazaki, S.; Uematsu, M.; Watanabe, K.,
An Experimental Study of Thermodynamic Properties of Trifluoromethane
in Proc. Symp. Thermophys. Prop., 8th, 1981, Gaithersburg, Vol. II, Sengers, J. V., Ed., ASME: New York, p. 370-6, 1982. [all data]
Wagner, 1968
Wagner, W.,
Thermodynamic properties of trifluoromethane,
Kaeltetech.-Klim., 1968, 20, 238-40. [all data]
Hou and Martin, 1959
Hou, Y.-C.; Martin, J.J.,
Physical and Thermodynamic properties of trifluoromethane,
AIChE J., 1959, 5, 125. [all data]
Stephenson and Malanowski, 1987
Stephenson, Richard M.; Malanowski, Stanislaw,
Handbook of the Thermodynamics of Organic Compounds, 1987, https://doi.org/10.1007/978-94-009-3173-2
. [all data]
Domalski and Hearing, 1996
Domalski, Eugene S.; Hearing, Elizabeth D.,
Heat Capacities and Entropies of Organic Compounds in the Condensed Phase. Volume III,
J. Phys. Chem. Ref. Data, 1996, 25, 1, 1, https://doi.org/10.1063/1.555985
. [all data]
Deyerl, Alconcel, et al., 2001
Deyerl, H.J.; Alconcel, L.S.; Continetti, R.E.,
Photodetachment imaging studies of the electron affinity of CF3,
J. Phys. Chem. A, 2001, 105, 3, 552-557, https://doi.org/10.1021/jp003137k
. [all data]
Bartmess, Scott, et al., 1979
Bartmess, J.E.; Scott, J.A.; McIver, R.T., Jr.,
The gas phase acidity scale from methanol to phenol,
J. Am. Chem. Soc., 1979, 101, 6047. [all data]
Paulino and Squires, 1991
Paulino, J.A.; Squires, R.R.,
Carbene Thermochemistry from Collision-Induced Dissociation Threshold Energy Measurements - The Heats of Formation of X1A1 CF2 and X1A1 CCl2,
J. Am. Chem. Soc., 1991, 113, 15, 5573, https://doi.org/10.1021/ja00015a009
. [all data]
Graul and Squires, 1990
Graul, S.T.; Squires, R.R.,
Gas-Phase Acidities Derived from Threshold Energies for Activated Reactions,
J. Am. Chem. Soc., 1990, 112, 7, 2517, https://doi.org/10.1021/ja00163a007
. [all data]
Larson and McMahon, 1987
Larson, J.W.; McMahon, T.B.,
Hydrogen bonding in gas phase anions. The energetics of interaction between cyanide ion and bronsted acids,
J. Am. Chem. Soc., 1987, 109, 6230. [all data]
Payzant, Yamdagni, et al., 1971
Payzant, J.D.; Yamdagni, R.; Kebarle, P.,
Hydration of CN-, NO2-, NO3-, and HO- in the gas phase,
Can. J. Chem., 1971, 49, 3308. [all data]
Larson and McMahon, 1984
Larson, J.W.; McMahon, T.B.,
Hydrogen bonding in gas phase anions. An experimental investigation of the interaction between chloride ion and bronsted acids from ICR chloride exchange equilibria,
J. Am. Chem. Soc., 1984, 106, 517. [all data]
Larson and McMahon, 1984, 2
Larson, J.W.; McMahon, T.B.,
Gas phase negative ion chemistry of alkylchloroformates,
Can. J. Chem., 1984, 62, 675. [all data]
French, Ikuta, et al., 1982
French, M.A.; Ikuta, S.; Kebarle, P.,
Hydrogen bonding of O-H and C-H hydrogen donors to Cl-. Results from mass spectrometric measurement of the ion-molecule equilibria RH + Cl- = RHCl-,
Can. J. Chem., 1982, 60, 1907. [all data]
Larson and McMahon, 1983
Larson, J.W.; McMahon, T.B.,
Strong hydrogen bonding in gas-phase anions. An ion cyclotron resonance determination of fluoride binding energetics to bronsted acids from gas-phase fluoride exchange equilibria measurements,
J. Am. Chem. Soc., 1983, 105, 2944. [all data]
Arshadi, Yamdagni, et al., 1970
Arshadi, M.; Yamdagni, R.; Kebarle, P.,
Hydration of Halide Negative Ions in the Gas Phase. II. Comparison of Hydration Energies for the Alkali Positive and Halide Negative Ions,
J. Phys. Chem., 1970, 74, 7, 1475, https://doi.org/10.1021/j100702a014
. [all data]
Chabinyc and Brauman, 2000
Chabinyc, M.L.; Brauman, J.I.,
Unusual ionic hydrogen bonds: Complexes of acetylides and fluoroform,
J. Am. Chem. Soc., 2000, 122, 36, 8739-8745, https://doi.org/10.1021/ja000806z
. [all data]
Chabinyc and Brauman, 1998
Chabinyc, M.L.; Brauman, J.I.,
Acidity, basicity, and the stability of hydrogen bonds: Complexes of RO-+HCF3,
J. Am. Chem. Soc., 1998, 120, 42, 10863-10870, https://doi.org/10.1021/ja9817592
. [all data]
Sharma, Meza de Hojer, et al., 1985
Sharma, D.M.S.; Meza de Hojer, S.; Kebarle, P.,
Stabilities of halonium ions from a study of gas-phase equilibria R+ + XR' = (RXR')+,
J. Am. Chem. Soc., 1985, 107, 13, 3757, https://doi.org/10.1021/ja00299a002
. [all data]
Brown, Ishikawa, et al., 1990
Brown, C.E.; Ishikawa, Y.; Hackett, P.A.; Rayner, D.M.,
J. Am. Chem. Soc., 1990, 112, 2530. [all data]
Caldwell, Masucci, et al., 1989
Caldwell, G.W.; Masucci, J.A.; Ikonomou, M.G.,
Negative Ion Chemical Ionization Mass Spectrometry - Binding of Molecules to Bromide and Iodide Anions,
Org. Mass Spectrom., 1989, 24, 1, 8, https://doi.org/10.1002/oms.1210240103
. [all data]
Corbett, Tarr, et al., 1963
Corbett, P.; Tarr, A.M.; Whittle, E.,
Vapour-phase bromination of fluoroform and methane,
Trans. Faraday Soc., 1963, 59, 1609. [all data]
Coomber and Whittle, 1967
Coomber, J.W.; Whittle, E.,
Bond dissociation energies from equilibrium studies. Part 1.-D(CF3-Br), D(C2F5-Br) and D(n-C3F7-Br),
Trans. Faraday Soc., 1967, 63, 608-619. [all data]
Hess and Kemnitz, 1992
Hess, A.; Kemnitz, E.,
Heterogeneously catalyzed dismutation and conmutation reactions of CHCl3-nFnchlorofluorocarbons. A kinetic study,
Appl. Catal. A:, 1992, 82, 247-257. [all data]
Hunter and Lias, 1998
Hunter, E.P.; Lias, S.G.,
Evaluated Gas Phase Basicities and Proton Affinities of Molecules: An Update,
J. Phys. Chem. Ref. Data, 1998, 27, 3, 413-656, https://doi.org/10.1063/1.556018
. [all data]
Novak, Potts, et al., 1985
Novak, I.; Potts, A.W.; Quinn, F.; Marr, G.V.; Dobson, B.; Hillier, I.H.; West, J.B.,
Photoelectron asymmetry measurements for CHF3 and CF4 in the photon energy range 19 to 80 eV,
J. Phys. B:, 1985, 18, 1581. [all data]
Wang and Leroi, 1983
Wang, F.C.-Y.; Leroi, G.E.,
Photoionization and fragmentation of halogenated methanes,
Ann. Isr. Phys. Soc., 1983, 6, 210. [all data]
Pullen, Carlson, et al., 1970
Pullen, B.P.; Carlson, T.A.; Moddeman, W.E.; Schweitzer, G.K.; Bull, W.E.,
Photoelectron spectra of methane, silane, germane, methyl fluoride, difluoromethane, and trifluoromethane,
J. Chem. Phys., 1970, 53, 768. [all data]
Brundle, Robin, et al., 1970
Brundle, C.R.; Robin, M.B.; Basch, H.,
Electronic energies and electronic structures of the fluoromethanes,
J. Chem. Phys., 1970, 53, 2196. [all data]
Stokes and Duncan, 1958
Stokes, S.; Duncan, A.B.F.,
Electronic transitions in methyl fluoride and in fluoroform,
J. Am. Chem. Soc., 1958, 80, 6177. [all data]
Bock, Wittmann, et al., 1982
Bock, H.; Wittmann, J.; Mintzer, J.; Russow, J.,
Ni/Pd-katalysierte gasphasen-bromierung von trifluormethan,
Chem. Ber., 1982, 115, 2346. [all data]
Bieri, Asbrink, et al., 1981
Bieri, G.; Asbrink, L.; Von Niessen, W.,
30.4 nm He(II) photoelectron spectra of organic molecules. Part IV. Fluoro-compounds (C,H,F),
J. Electron Spectrosc. Relat. Phenom., 1981, 23, 281. [all data]
Demuth, 1977
Demuth, R.,
Photoelektronenspektren von einigen Trihalogensilylphosphanen und -arsanen X3SiER2 (X = F, Cl; E = N, P, As; R = H, CH3),
Z. Naturforsch. B:, 1977, 32, 1252. [all data]
Harshbarger, Robin, et al., 1973
Harshbarger, W.R.; Robin, M.B.; Lassettre, E.N.,
The electron impact spectra of the fluoromethanes,
J. Electron Spectrosc. Relat. Phenom., 1973, 1, 319. [all data]
Goto, Nakamura, et al., 1994
Goto, M.; Nakamura, K.; Toyoda, H.; Sugai, H.,
Cross section measurements for electron-impact dissociation of CHF3 into neutral and ionic fragments,
Jpn. J. Appl. Phys. Part 1, 1994, 33, 3602. [all data]
Hobrock and Kiser, 1964
Hobrock, D.L.; Kiser, R.W.,
Electron impact studies of some trihalomethanes: trichloromethane, dichlorofluoro-methane, chlorodifluoromethane, and trifluoromethane,
J. Phys. Chem., 1964, 68, 575. [all data]
Steele, 1964
Steele, W.C.,
Appearance potentials of the difluoromethylene positive ion,
J. Phys. Chem., 1964, 68, 2359. [all data]
Noutary, 1968
Noutary, C.J.,
Mass spectrometric study of some fluorocarbons and trifluoromethyl halides,
J.Res. NBS, 1968, 72A, 479. [all data]
Martin, Lampe, et al., 1966
Martin, R.H.; Lampe, F.W.; Taft, R.W.,
An electron-impact study of ionization and dissociation in methoxy- and halogen- substituted methanes,
J. Am. Chem. Soc., 1966, 88, 1353. [all data]
Lifshitz and Long, 1965
Lifshitz, C.; Long, F.A.,
Appearance potentials and mass spectra of fluorinated ethylenes. II. Heats offormation of fluorinated species and their positive ions,
J. Phys. Chem., 1965, 69, 3731. [all data]