Difluorochloromethane
- Formula: CHClF2
- Molecular weight: 86.468
- IUPAC Standard InChIKey: VOPWNXZWBYDODV-UHFFFAOYSA-N
- CAS Registry Number: 75-45-6
- Chemical structure:
View 3d structure (requires JavaScript / HTML 5) - Other names: Methane, chlorodifluoro-; Algeon 22; Algofrene Type 6; Arcton 4; Chlorodifluoromethane; Difluoromonochloromethane; Electro-CF 22; F 22; Freon 22; Frigen 22; FC 22; Genetron 22; Isotron 22; Monochlorodifluoromethane; R 22; Ucon 22; CHF2Cl; Algofrene 22; Arcton 22; CFC 22; Daiflon 22; Dymel 22; Eskimon 22; Flugene 22; Fluorocarbon-22; Forane 22; Frigen; Haltron 22; Isceon 22; Khaladon 22; Monochlorodifluormethane; Propellant 22; Refrigerant 22; UN 1018; CHClF2; Algofrene 6; Khladon 22; Flon 22; F 22 (halocarbon); FKW 22; HCFC 22; HFA-22; Refrigerant R 22; Methane, difluoro chloro

Phase change data

Data compiled as indicated in comments:
TRC - Thermodynamics Research Center, NIST Boulder Laboratories, Chris Muzny director
DH - Eugene S. Domalski and Elizabeth D. Hearing
AC - William E. Acree, Jr., James S. Chickos
CAL - James S. Chickos, William E. Acree, Jr., Joel F. Liebman, Students of Chem 202 (Introduction to the Literature of Chemistry), University of Missouri -- St. Louis
Quantity | Value | Units | Method | Reference | Comment |
---|---|---|---|---|---|
Tboil | 313.3 | K | N/A | Seliverstov, 1970 | Uncertainty assigned by TRC = 0.6 K; TRC |
Quantity | Value | Units | Method | Reference | Comment |
Tfus | 114. | K | N/A | Wang, Adcock, et al., 1991 | Uncertainty assigned by TRC = 2. K; TRC |
Quantity | Value | Units | Method | Reference | Comment |
Ttriple | 115.760 | K | N/A | Blanke and Weiss, 1991 | Uncertainty assigned by TRC = 0.01 K; on ITS-90; TRC |
Ttriple | 115.73 | K | N/A | Neilson and White, 1957 | Crystal phase 1 phase; Uncertainty assigned by TRC = 0.02 K; TRC |
Quantity | Value | Units | Method | Reference | Comment |
Tc | 369.2 ± 0.6 | K | AVG | N/A | Average of 12 values; Individual data points |
Quantity | Value | Units | Method | Reference | Comment |
Pc | 49.8 ± 0.6 | bar | AVG | N/A | Average of 9 values; Individual data points |
Quantity | Value | Units | Method | Reference | Comment |
Vc | 0.147 | l/mol | N/A | Wang, Adcock, et al., 1991 | Uncertainty assigned by TRC = 0.005 l/mol; TRC |
Quantity | Value | Units | Method | Reference | Comment |
ρc | 7. ± 2. | mol/l | AVG | N/A | Average of 6 values; Individual data points |
Enthalpy of vaporization
ΔvapH (kJ/mol) | Temperature (K) | Method | Reference | Comment |
---|---|---|---|---|
20.217 | 232.50 | N/A | Neilson and White, 1957, 2 | P = 101.325 kPa.; DH |
20.0 | 290. | A | Stephenson and Malanowski, 1987 | Based on data from 275. to 327. K.; AC |
21.3 | 218. | A | Stephenson and Malanowski, 1987 | Based on data from 170. to 233. K.; AC |
20.4 | 260. | A | Stephenson and Malanowski, 1987 | Based on data from 230. to 275. K.; AC |
20.1 | 339. | A | Stephenson and Malanowski, 1987 | Based on data from 324. to 366. K.; AC |
21.8 | 209. | N/A | Kudchadker, Kudchadker, et al., 1979 | Based on data from 194. to 310. K.; AC |
21.0 | 232. | N/A | Kletskii, 1964 | Based on data from 229. to 236. K.; AC |
20.2 | 232. | C | Neilson and White, 1957, 2 | AC |
Entropy of vaporization
ΔvapS (J/mol*K) | Temperature (K) | Reference | Comment |
---|---|---|---|
86.95 | 232.50 | Neilson and White, 1957, 2 | P; DH |
Antoine Equation Parameters
log10(P) = A − (B / (T + C))
P = vapor pressure (bar)
T = temperature (K)
View plot Requires a JavaScript / HTML 5 canvas capable browser.
Temperature (K) | A | B | C | Reference | Comment |
---|---|---|---|---|---|
229.60 to 236.40 | 4.17693 | 857.673 | -26.667 | Kletskii, 1964, 2 | Coefficents calculated by NIST from author's data. |
232.4 to 358.5 | 4.36567 | 947.577 | -14.964 | Stull, 1947 | Coefficents calculated by NIST from author's data. |
Enthalpy of fusion
ΔfusH (kJ/mol) | Temperature (K) | Reference | Comment |
---|---|---|---|
4.12 | 115.7 | Domalski and Hearing, 1996 | AC |
Entropy of fusion
ΔfusS (J/mol*K) | Temperature (K) | Reference | Comment |
---|---|---|---|
1.13 | 59. | Domalski and Hearing, 1996 | CAL |
35.65 | 115.7 |
Enthalpy of phase transition
ΔHtrs (kJ/mol) | Temperature (K) | Initial Phase | Final Phase | Reference | Comment |
---|---|---|---|---|---|
0.067 | 59. | crystaline, II | crystaline, I | Neilson and White, 1957, 2 | DH |
4.1233 | 115.73 | crystaline, I | liquid | Neilson and White, 1957, 2 | DH |
Entropy of phase transition
ΔStrs (J/mol*K) | Temperature (K) | Initial Phase | Final Phase | Reference | Comment |
---|---|---|---|---|---|
1.14 | 59. | crystaline, II, Lambda | crystaline, I, type transition | Neilson and White, 1957, 2 | DH |
35.63 | 115.73 | crystaline, I | liquid | Neilson and White, 1957, 2 | DH |

Reaction thermochemistry data

Data compiled as indicated in comments:
B - John E. Bartmess
M - Michael M. Meot-Ner (Mautner) and Sharon G. Lias
ALS - Hussein Y. Afeefy, Joel F. Liebman, and Stephen E. Stein
Individual Reactions
CClF2- + =
By formula: CClF2- + H+ = CHClF2
Quantity | Value | Units | Method | Reference | Comment |
---|---|---|---|---|---|
ΔrH° | >1567.8 | kJ/mol | Acid | Paulino and Squires, 1991 | gas phase; Probably CF2..Cl-, non-covalent.; B |
ΔrH° | 1583. ± 29. | kJ/mol | D-EA | Dispert and Lacmann, 1978 | gas phase; From CF2Cl2; B |
Quantity | Value | Units | Method | Reference | Comment |
ΔrG° | >1535.4 ± 3.7 | kJ/mol | H-TS | Paulino and Squires, 1991 | gas phase; Probably CF2..Cl-, non-covalent.; B |
ΔrG° | 1550. ± 30. | kJ/mol | H-TS | Dispert and Lacmann, 1978 | gas phase; From CF2Cl2; B |
By formula: Cl- + CHClF2 = (Cl- • CHClF2)
Quantity | Value | Units | Method | Reference | Comment |
---|---|---|---|---|---|
ΔrH° | 72.0 ± 8.4 | kJ/mol | IMRE | Larson and McMahon, 1984 | gas phase; B,M |
Quantity | Value | Units | Method | Reference | Comment |
ΔrS° | 96.2 | J/mol*K | N/A | Larson and McMahon, 1984 | gas phase; switching reaction(Cl-)CF3H, Entropy change calculated or estimated; Larson and McMahon, 1984, 2; M |
Quantity | Value | Units | Method | Reference | Comment |
ΔrG° | 43.1 ± 8.4 | kJ/mol | IMRE | Larson and McMahon, 1984 | gas phase; B,M |
By formula: 2CHClF2 = C2F4 + 2HCl
Quantity | Value | Units | Method | Reference | Comment |
---|---|---|---|---|---|
ΔrH° | 121.6 | kJ/mol | Kin | Edwards and Small, 1965 | gas phase; Corrected for CODATA value of ΔfH; ALS |
By formula: 2CHCl2F = CHCl3 + CHClF2
Quantity | Value | Units | Method | Reference | Comment |
---|---|---|---|---|---|
ΔrH° | -14.2 ± 2.0 | kJ/mol | Eqk | Hess and Kemnitz, 1992 | gas phase; Gas Phase; ALS |
By formula: 2CHClF2 = CHCl2F + CHF3
Quantity | Value | Units | Method | Reference | Comment |
---|---|---|---|---|---|
ΔrH° | -14.2 ± 2.0 | kJ/mol | Eqk | Hess and Kemnitz, 1992 | gas phase; ALS |

Gas phase ion energetics data

Data evaluated as indicated in comments:
L - Sharon G. Lias
Data compiled as indicated in comments:
B - John E. Bartmess
LBLHLM - Sharon G. Lias, John E. Bartmess, Joel F. Liebman, John L. Holmes, Rhoda D. Levin, and W. Gary Mallard
LLK - Sharon G. Lias, Rhoda D. Levin, and Sherif A. Kafafi
RDSH - Henry M. Rosenstock, Keith Draxl, Bruce W. Steiner, and John T. Herron
Quantity | Value | Units | Method | Reference | Comment |
---|---|---|---|---|---|
IE (evaluated) | 12.28 ± 0.02 | eV | N/A | N/A | L |
Ionization energy determinations
IE (eV) | Method | Reference | Comment |
---|---|---|---|
12.28 ± 0.02 | PI | Wang and Leroi, 1983 | LBLHLM |
12.1 | PE | Novak, Cvitas, et al., 1981 | LLK |
12.45 ± 0.05 | PI | Watanabe, Nakayama, et al., 1962 | RDSH |
12.56 | PE | Novak, Cvitas, et al., 1981 | Vertical value; LLK |
12.6 | PE | Doucet, Sauvageau, et al., 1973 | Vertical value; LLK |
Appearance energy determinations
Ion | AE (eV) | Other Products | Method | Reference | Comment |
---|---|---|---|---|---|
CFCl+ | 15.9 ± 0.3 | ? | EI | Hobrock and Kiser, 1964 | RDSH |
CF+ | 17. ± 0. | ? | EI | Hobrock and Kiser, 1964 | RDSH |
CF2+ | 16.1 ± 0.3 | ? | EI | Hobrock and Kiser, 1964 | RDSH |
CHFCl+ | 15.11 ± 0.15 | F | EI | Hobrock and Kiser, 1964 | RDSH |
CHF2+ | 12.59 ± 0.15 | Cl | EI | Hobrock and Kiser, 1964 | RDSH |
Cl+ | 20.5 ± 0.3 | ? | EI | Hobrock and Kiser, 1964 | RDSH |
De-protonation reactions
CClF2- + =
By formula: CClF2- + H+ = CHClF2
Quantity | Value | Units | Method | Reference | Comment |
---|---|---|---|---|---|
ΔrH° | >1567.8 | kJ/mol | Acid | Paulino and Squires, 1991 | gas phase; Probably CF2..Cl-, non-covalent.; B |
ΔrH° | 1583. ± 29. | kJ/mol | D-EA | Dispert and Lacmann, 1978 | gas phase; From CF2Cl2; B |
Quantity | Value | Units | Method | Reference | Comment |
ΔrG° | >1535.4 ± 3.7 | kJ/mol | H-TS | Paulino and Squires, 1991 | gas phase; Probably CF2..Cl-, non-covalent.; B |
ΔrG° | 1550. ± 30. | kJ/mol | H-TS | Dispert and Lacmann, 1978 | gas phase; From CF2Cl2; B |

Ion clustering data

Data compiled as indicated in comments:
B - John E. Bartmess
M - Michael M. Meot-Ner (Mautner) and Sharon G. Lias
Clustering reactions
By formula: Cl- + CHClF2 = (Cl- • CHClF2)
Quantity | Value | Units | Method | Reference | Comment |
---|---|---|---|---|---|
ΔrH° | 72.0 ± 8.4 | kJ/mol | IMRE | Larson and McMahon, 1984 | gas phase; B,M |
Quantity | Value | Units | Method | Reference | Comment |
ΔrS° | 96.2 | J/mol*K | N/A | Larson and McMahon, 1984 | gas phase; switching reaction(Cl-)CF3H, Entropy change calculated or estimated; Larson and McMahon, 1984, 2; M |
Quantity | Value | Units | Method | Reference | Comment |
ΔrG° | 43.1 ± 8.4 | kJ/mol | IMRE | Larson and McMahon, 1984 | gas phase; B,M |

Gas phase thermochemistry data

Data compiled as indicated in comments:
ALS - Hussein Y. Afeefy, Joel F. Liebman, and Stephen E. Stein
Quantity | Value | Units | Method | Reference | Comment |
---|---|---|---|---|---|
ΔfH°gas | -481.58 | kJ/mol | Review | Chase, 1998 | Data last reviewed in June, 1970 |
ΔfH°gas | -483. ± 3. | kJ/mol | Kin | Edwards and Small, 1965 | Corrected for CODATA value of ΔfH; ALS |
Quantity | Value | Units | Method | Reference | Comment |
S°gas,1 bar | 280.96 | J/mol*K | Review | Chase, 1998 | Data last reviewed in June, 1970 |
Gas Phase Heat Capacity (Shomate Equation)
Cp° = A + B*t + C*t2 + D*t3 +
E/t2
H° − H°298.15= A*t + B*t2/2 +
C*t3/3 + D*t4/4 − E/t + F − H
S° = A*ln(t) + B*t + C*t2/2 + D*t3/3 −
E/(2*t2) + G
Cp = heat capacity (J/mol*K)
H° = standard enthalpy (kJ/mol)
S° = standard entropy (J/mol*K)
t = temperature (K) / 1000.
View plot Requires a JavaScript / HTML 5 canvas capable browser.
Temperature (K) | 298. to 1200. | 1200. to 6000. |
---|---|---|
A | 25.33466 | 101.0829 |
B | 150.9600 | 3.643604 |
C | -116.1432 | -0.699594 |
D | 33.38334 | 0.046574 |
E | -0.339043 | -11.47475 |
F | -496.0216 | -539.3469 |
G | 269.5693 | 364.7544 |
H | -481.5784 | -481.5784 |
Reference | Chase, 1998 | Chase, 1998 |
Comment | Data last reviewed in June, 1970 | Data last reviewed in June, 1970 |

Henry's Law data

Data compiled by: Rolf Sander
Henry's Law constant (water solution)
kH(T) = k°H exp(d(ln(kH))/d(1/T) ((1/T) - 1/(298.15 K)))
k°H = Henry's law constant for solubility in water at 298.15 K (mol/(kg*bar))
d(ln(kH))/d(1/T) = Temperature dependence constant (K)
k°H (mol/(kg*bar)) | d(ln(kH))/d(1/T) (K) | Method | Reference | Comment |
---|---|---|---|---|
0.24 | C | N/A | The temperature dependence (after a unit conversion) is given as: kH = exp(-8.689 + 205.9 / (T - 255.1)) * 11.7 M/atm. This can obviously only be valid for T >> 255.1 K. | |
0.033 | Q | N/A | missing citation give several references for the Henry's law constants but don't assign them to specific species. | |
0.031 | 3400. | X | N/A | |
0.034 | 3400. | L | N/A | |
0.034 | V | N/A |

Normal alkane RI, non-polar column, temperature ramp

Column type | Active phase | I | Reference | Comment |
---|---|---|---|---|
Capillary | OV-101 | 301. | Zenkevich, 2005 | 25. m/0.20 mm/0.10 μm, N2/He, 6. K/min; Tstart: 50. C; Tend: 250. C |

Normal alkane RI, non-polar column, custom temperature program

Column type | Active phase | I | Reference | Comment |
---|---|---|---|---|
Capillary | Methyl Silicone | 305. | Blunden, Aneja, et al., 2005 | 60. m/0.32 mm/1.0 μm, Helium; Program: -50 0C (2 min) 8 0C/min -> 200 0C (7.75 min) 25 0C -> 225 0C (8 min) |
Capillary | SPB-1 | 258. | Flanagan, Streete, et al., 1997 | 60. m/0.53 mm/5. μm, He; Program: 40C(6min) => 5C/min => 80C => 10C/min => 200C |
Capillary | SPB-1 | 309. | Strete, Ruprah, et al., 1992 | 60. m/0.53 mm/5.0 μm, Helium; Program: 40 0C (6 min) 5 0C/min -> 80 0C 10 0C/min -> 200 0C |

Condensed phase thermochemistry data

Data compiled by: Eugene S. Domalski and Elizabeth D. Hearing
Quantity | Value | Units | Method | Reference | Comment |
---|---|---|---|---|---|
S°liquid | 179.91 | J/mol*K | N/A | Neilson and White, 1957 |
Constant pressure heat capacity of liquid
Cp,liquid (J/mol*K) | Temperature (K) | Reference | Comment |
---|---|---|---|
93.01 | 232.50 | Neilson and White, 1957 | T = 16 to 230 K. |
114.10 | 298.15 | Benning, McHarness, et al., 1940 | T = 256 to 328 K. Data calculated from equation. |

References

Seliverstov, 1970
Seliverstov, V.M.,
Solubility of difluoromonochloromethane in certain phthalates, dioctyl sebacate, triacetin, and dimethylformamide,
Zh. Prikl. Khim. (Leningrad), 1970, 43, 1605-7. [all data]
Wang, Adcock, et al., 1991
Wang, B.H.; Adcock, J.L.; Mathur, S.B.; Van Hook, W.A.,
Vapor pressures, liquid molar volumes, vapor non-idealities, and critical properties of some fluorinated ethers: CF3OCF2OCF3, CF3OCF2CF2H, c-CF2CF2 CF2O, CF3OCF2H, and CF3OCH3; and of CCl3F and CF2CI,
J. Chem. Thermodyn., 1991, 23, 699-710. [all data]
Blanke and Weiss, 1991
Blanke, W.; Weiss, R.,
Thermodynamic properties of refrigerants. Part I: the triple points of the refrigerants R11, R12, R22, R142b, and 152a,
PTB-Mitt., 1991, 101, 337-9. [all data]
Neilson and White, 1957
Neilson, E.F.; White, D.,
Heat Capacity, Heat of Fusion, Heat of Transition, and Heat of Vapor- ization of Chlorodifluoromethane Between 16 K and the Boiling Point,
J. Am. Chem. Soc., 1957, 79, 5618. [all data]
Neilson and White, 1957, 2
Neilson, E.F.; White, D.,
The heat capacity, heat of fusion, heat of transition and heat of vaporization of chlorodifluoromethane between 16°K and the boiling point,
J. Am. Chem. Soc., 1957, 79, 5618-5621. [all data]
Stephenson and Malanowski, 1987
Stephenson, Richard M.; Malanowski, Stanislaw,
Handbook of the Thermodynamics of Organic Compounds, 1987, https://doi.org/10.1007/978-94-009-3173-2
. [all data]
Kudchadker, Kudchadker, et al., 1979
Kudchadker, A.P.; Kudchadker, S.A.; Shukla, R.P.; Patnaik, P.R.,
Vapor pressures and boiling points of selected halomethanes,
J. Phys. Chem. Ref. Data, 1979, 8, 2, 499, https://doi.org/10.1063/1.555600
. [all data]
Kletskii, 1964
Kletskii, A.V.,
Inzh. Fiz. Zh. Akad. Nauk Beldrussk. SSR, 1964, 7, 40. [all data]
Kletskii, 1964, 2
Kletskii, A.V.,
Dependence of Vapor Pressure Freon - 22,
Inzh. Fiz. Zh., 1964, 7, 40-43. [all data]
Stull, 1947
Stull, Daniel R.,
Vapor Pressure of Pure Substances. Organic and Inorganic Compounds,
Ind. Eng. Chem., 1947, 39, 4, 517-540, https://doi.org/10.1021/ie50448a022
. [all data]
Domalski and Hearing, 1996
Domalski, Eugene S.; Hearing, Elizabeth D.,
Heat Capacities and Entropies of Organic Compounds in the Condensed Phase. Volume III,
J. Phys. Chem. Ref. Data, 1996, 25, 1, 1, https://doi.org/10.1063/1.555985
. [all data]
Paulino and Squires, 1991
Paulino, J.A.; Squires, R.R.,
Carbene Anion Complexes - Unusual Structural and Thermochemical Features of alpha-Halocarbanions in the Gas Phase,
J. Am. Chem. Soc., 1991, 113, 5, 1845, https://doi.org/10.1021/ja00005a067
. [all data]
Dispert and Lacmann, 1978
Dispert, H.; Lacmann, K.,
Negative ion formation in collisions between potassium and fluoro- and chloromethanes: Electron affinities and bond dissociation energies,
Int. J. Mass Spectrom. Ion Phys., 1978, 28, 49. [all data]
Larson and McMahon, 1984
Larson, J.W.; McMahon, T.B.,
Hydrogen bonding in gas phase anions. An experimental investigation of the interaction between chloride ion and bronsted acids from ICR chloride exchange equilibria,
J. Am. Chem. Soc., 1984, 106, 517. [all data]
Larson and McMahon, 1984, 2
Larson, J.W.; McMahon, T.B.,
Gas phase negative ion chemistry of alkylchloroformates,
Can. J. Chem., 1984, 62, 675. [all data]
Edwards and Small, 1965
Edwards, J.W.; Small, P.A.,
Kinetics of the pyrolysis of chlorodifluoromethane,
Ind. Eng. Chem. Fundam., 1965, 4, 396-400. [all data]
Hess and Kemnitz, 1992
Hess, A.; Kemnitz, E.,
Heterogeneously catalyzed dismutation and conmutation reactions of CHCl3-nFnchlorofluorocarbons. A kinetic study,
Appl. Catal. A:, 1992, 82, 247-257. [all data]
Wang and Leroi, 1983
Wang, F.C.-Y.; Leroi, G.E.,
Photoionization and fragmentation of halogenated methanes,
Ann. Isr. Phys. Soc., 1983, 6, 210. [all data]
Novak, Cvitas, et al., 1981
Novak, I.; Cvitas, T.; Klasinc, L.; Gusten, H.,
Photoelectron spectra of some halogenomethanes,
J. Chem. Soc. Faraday Trans. 2, 1981, 77, 2049. [all data]
Watanabe, Nakayama, et al., 1962
Watanabe, K.; Nakayama, T.; Mottl, J.,
Ionization potentials of some molecules,
J. Quant. Spectry. Radiative Transfer, 1962, 2, 369. [all data]
Doucet, Sauvageau, et al., 1973
Doucet, J.; Sauvageau, P.; Sandorfy, C.,
Vacuum ultraviolet and photoelectron spectra of fluoro-chloro derivatives of methane,
J. Chem. Phys., 1973, 58, 3708. [all data]
Hobrock and Kiser, 1964
Hobrock, D.L.; Kiser, R.W.,
Electron impact studies of some trihalomethanes: trichloromethane, dichlorofluoro-methane, chlorodifluoromethane, and trifluoromethane,
J. Phys. Chem., 1964, 68, 575. [all data]