Phosgene
- Formula: CCl2O
- Molecular weight: 98.916
- IUPAC Standard InChIKey: YGYAWVDWMABLBF-UHFFFAOYSA-N
- CAS Registry Number: 75-44-5
- Chemical structure:
View 3d structure (requires JavaScript / HTML 5) - Other names: Carbonyl dichloride; Carbonic dichloride; Carbon dichloride oxide; Carbon oxychloride; Carbonyl chloride; Chloroformyl chloride; CG; COCl2; Carbone (oxychlorure de); Carbonic chloride; Carbonio (ossicloruro di); Carbonylchlorid; Fosgeen; Fosgen; Fosgene; Koolstofoxychloride; NCI-C60219; Phosgen; Rcra waste number P095; UN 1076; Dichloroformaldehyde

Gas phase thermochemistry data

Data compiled as indicated in comments:
ALS - Hussein Y. Afeefy, Joel F. Liebman, and Stephen E. Stein
Quantity | Value | Units | Method | Reference | Comment |
---|---|---|---|---|---|
ΔfH°gas | -220.08 | kJ/mol | Review | Chase, 1998 | Data last reviewed in June, 1961 |
ΔfH°gas | -220.1 ± 0.96 | kJ/mol | Cm | Davies and Pritchard, 1972 | Heat of hydrolysis; ALS |
ΔfH°gas | -219.1 ± 0.59 | kJ/mol | Eqk | Lord and Pritchard, 1970 | ALS |
ΔfH°gas | -209.5 ± 1.2 | kJ/mol | Eqk | Lord and Pritchard, 1969 | Reanalyzed by Pedley, Naylor, et al., 1986, Original value = -218.9 ± 0.3 kJ/mol; ALS |
Quantity | Value | Units | Method | Reference | Comment |
ΔcH°gas | -108.6 ± 0.42 | kJ/mol | Eqk | Lord and Pritchard, 1970 | ALS |
Quantity | Value | Units | Method | Reference | Comment |
S°gas,1 bar | 283.80 | J/mol*K | Review | Chase, 1998 | Data last reviewed in June, 1961 |
Gas Phase Heat Capacity (Shomate Equation)
Cp° = A + B*t + C*t2 + D*t3 +
E/t2
H° − H°298.15= A*t + B*t2/2 +
C*t3/3 + D*t4/4 − E/t + F − H
S° = A*ln(t) + B*t + C*t2/2 + D*t3/3 −
E/(2*t2) + G
Cp = heat capacity (J/mol*K)
H° = standard enthalpy (kJ/mol)
S° = standard entropy (J/mol*K)
t = temperature (K) / 1000.
View plot Requires a JavaScript / HTML 5 canvas capable browser.
Temperature (K) | 298. to 600. | 600. to 6000. |
---|---|---|
A | 36.64799 | 78.19770 |
B | 115.1274 | 3.286914 |
C | -128.6208 | -0.757840 |
D | 57.68690 | 0.057932 |
E | -0.299915 | -3.292010 |
F | -236.1052 | -253.2500 |
G | 297.3410 | 362.6110 |
H | -220.0784 | -220.0784 |
Reference | Chase, 1998 | Chase, 1998 |
Comment | Data last reviewed in June, 1961 | Data last reviewed in June, 1961 |

Condensed phase thermochemistry data

Data compiled by: Eugene S. Domalski and Elizabeth D. Hearing
Quantity | Value | Units | Method | Reference | Comment |
---|---|---|---|---|---|
S°liquid | 192.80 | J/mol*K | N/A | Giauque and Ott, 1960 | Data for liquid from 48GIA/JON. |
S°liquid | 198.11 | J/mol*K | N/A | Giauque and Jones, 1948 | A value of S0 of 6.82 J/mol*K has been added to the calorimetric value of S280-S0. |
Constant pressure heat capacity of liquid
Cp,liquid (J/mol*K) | Temperature (K) | Reference | Comment |
---|---|---|---|
102.59 | 160.55 | Giauque and Ott, 1960 | T = 13 to 160 K. Value is unsmoothed experimental datum. |
100.79 | 280. | Giauque and Jones, 1948 | T = 15 to 280 K. |

Phase change data

Data compiled as indicated in comments:
TRC - Thermodynamics Research Center, NIST Boulder Laboratories, Chris Muzny director
DH - Eugene S. Domalski and Elizabeth D. Hearing
AC - William E. Acree, Jr., James S. Chickos
Quantity | Value | Units | Method | Reference | Comment |
---|---|---|---|---|---|
Ttriple | 139.19 | K | N/A | Giauque and Ott, 1960 | Crystal phase 3 phase; Uncertainty assigned by TRC = 0.2 K; TRC |
Ttriple | 145.37 | K | N/A | Giauque and Ott, 1960 | Crystal phase 1 phase; Uncertainty assigned by TRC = 0.02 K; TRC |
Ttriple | 142.09 | K | N/A | Giauque and Ott, 1960 | Crystal phase 2 phase; Uncertainty assigned by TRC = 0.05 K; TRC |
Ttriple | 145.37 | K | N/A | Giauque and Jones, 1948, 2 | Uncertainty assigned by TRC = 0.02 K; adiabatic calorimeter method; TRC |
Enthalpy of vaporization
ΔvapH (kJ/mol) | Temperature (K) | Method | Reference | Comment |
---|---|---|---|---|
24.401 | 280.71 | N/A | Giauque and Jones, 1948 | P = 101.325 kPa.; DH |
24.5 | 295. | A | Stephenson and Malanowski, 1987 | Based on data from 280. to 341. K.; AC |
25.7 | 266. | A | Stephenson and Malanowski, 1987 | Based on data from 240. to 281. K.; AC |
24.5 | 353. | A | Stephenson and Malanowski, 1987 | Based on data from 338. to 410. K.; AC |
24.4 | 421. | A | Stephenson and Malanowski, 1987 | Based on data from 406. to 455. K.; AC |
27.0 | 233. | N/A | Giauque and Jones, 1948 | Based on data from 215. to 248. K.; AC |
25.8 | 258. | N/A | Stull, 1947 | Based on data from 180. to 273. K.; AC |
Entropy of vaporization
ΔvapS (J/mol*K) | Temperature (K) | Reference | Comment |
---|---|---|---|
86.93 | 280.71 | Giauque and Jones, 1948 | P; DH |
Antoine Equation Parameters
log10(P) = A − (B / (T + C))
P = vapor pressure (bar)
T = temperature (K)
View plot Requires a JavaScript / HTML 5 canvas capable browser.
Temperature (K) | A | B | C | Reference | Comment |
---|---|---|---|---|---|
215.53 to 281. | 4.05103 | 978.937 | -38.717 | Giauque and Jones, 1948 | Coefficents calculated by NIST from author's data. |
180.3 to 281.4 | 3.94888 | 945.332 | -41.715 | Stull, 1947 | Coefficents calculated by NIST from author's data. |
281.4 to 447. | 4.27105 | 1072.71 | -29.855 | Stull, 1947 | Coefficents calculated by NIST from author's data. |
Enthalpy of fusion
ΔfusH (kJ/mol) | Temperature (K) | Reference | Comment |
---|---|---|---|
5.736 | 145.37 | Giauque and Jones, 1948 | DH |
5.73 | 145.3 | Giauque and Jones, 1948 | AC |
Entropy of fusion
ΔfusS (J/mol*K) | Temperature (K) | Reference | Comment |
---|---|---|---|
39.46 | 145.37 | Giauque and Jones, 1948 | DH |
Enthalpy of phase transition
ΔHtrs (kJ/mol) | Temperature (K) | Initial Phase | Final Phase | Reference | Comment |
---|---|---|---|---|---|
4.732 | 139.19 | crystaline, III | liquid | Giauque and Ott, 1960 | DH |
5.586 | 142.09 | crystaline, II | liquid | Giauque and Ott, 1960 | DH |
5.745 | 145.37 | crystaline, I | liquid | Giauque and Ott, 1960 | DH |
Entropy of phase transition
ΔStrs (J/mol*K) | Temperature (K) | Initial Phase | Final Phase | Reference | Comment |
---|---|---|---|---|---|
34.00 | 139.19 | crystaline, III | liquid | Giauque and Ott, 1960 | DH |
39.31 | 142.09 | crystaline, II | liquid | Giauque and Ott, 1960 | DH |
39.52 | 145.37 | crystaline, I | liquid | Giauque and Ott, 1960 | DH |

Reaction thermochemistry data

Data compiled as indicated in comments:
B - John E. Bartmess
M - Michael M. Meot-Ner (Mautner) and Sharon G. Lias
ALS - Hussein Y. Afeefy, Joel F. Liebman, and Stephen E. Stein
Individual Reactions
By formula: Cl- + CCl2O = (Cl- • CCl2O)
Quantity | Value | Units | Method | Reference | Comment |
---|---|---|---|---|---|
ΔrH° | 52.3 ± 8.4 | kJ/mol | IMRE | Larson and McMahon, 1985 | gas phase; B,M |
Quantity | Value | Units | Method | Reference | Comment |
ΔrS° | 84. | J/mol*K | N/A | Larson and McMahon, 1985 | gas phase; switching reaction,Thermochemical ladder(Cl-)t-C4H9OH, Entropy change calculated or estimated; M |
Quantity | Value | Units | Method | Reference | Comment |
ΔrG° | 27. ± 8.4 | kJ/mol | IMRE | Larson and McMahon, 1985 | gas phase; B,M |
By formula: CO2 + CCl4 = 2CCl2O
Quantity | Value | Units | Method | Reference | Comment |
---|---|---|---|---|---|
ΔrH° | 70. ± 2. | kJ/mol | Eqk | Lord and Pritchard, 1969 | gas phase; Two values for Hf; ALS |
ΔrH° | 70. ± 2. | kJ/mol | Eqk | Lord and Pritchard, 1969 | gas phase; Two values for Hf; ALS |
By formula: CCl2O + H2O = CO2 + 2HCl
Quantity | Value | Units | Method | Reference | Comment |
---|---|---|---|---|---|
ΔrH° | -72.19 ± 0.90 | kJ/mol | Cm | Davies and Pritchard, 1972 | gas phase; Heat of hydrolysis; ALS |
By formula: 2CCl2O = CO2 + CCl4
Quantity | Value | Units | Method | Reference | Comment |
---|---|---|---|---|---|
ΔrH° | -70. ± 2. | kJ/mol | Eqk | Lord and Pritchard, 1969 | gas phase; ALS |

Gas phase ion energetics data

Data compiled as indicated in comments:
LLK - Sharon G. Lias, Rhoda D. Levin, and Sherif A. Kafafi
RDSH - Henry M. Rosenstock, Keith Draxl, Bruce W. Steiner, and John T. Herron
Ionization energy determinations
IE (eV) | Method | Reference | Comment |
---|---|---|---|
~11.2 | PE | Thomas and Thompson, 1972 | LLK |
11.55 ± 0.02 | PE | Chadwick, 1972 | LLK |
11.7 | CI | Cermak, 1968 | RDSH |
11.84 | PE | Johnson, Powis, et al., 1979 | Vertical value; LLK |
Appearance energy determinations
Ion | AE (eV) | Other Products | Method | Reference | Comment |
---|---|---|---|---|---|
COCl+ | 11.2 ± 0.2 | Cl | PI | Johnson, Powis, et al., 1979 | LLK |
Cl+ | 16.5 ± 0.2 | Cl,CO | PI | Johnson, Powis, et al., 1979 | LLK |

Ion clustering data

Data compiled as indicated in comments:
B - John E. Bartmess
M - Michael M. Meot-Ner (Mautner) and Sharon G. Lias
Clustering reactions
By formula: Cl- + CCl2O = (Cl- • CCl2O)
Quantity | Value | Units | Method | Reference | Comment |
---|---|---|---|---|---|
ΔrH° | 52.3 ± 8.4 | kJ/mol | IMRE | Larson and McMahon, 1985 | gas phase; B,M |
Quantity | Value | Units | Method | Reference | Comment |
ΔrS° | 84. | J/mol*K | N/A | Larson and McMahon, 1985 | gas phase; switching reaction,Thermochemical ladder(Cl-)t-C4H9OH, Entropy change calculated or estimated; M |
Quantity | Value | Units | Method | Reference | Comment |
ΔrG° | 27. ± 8.4 | kJ/mol | IMRE | Larson and McMahon, 1985 | gas phase; B,M |

Normal alkane RI, non-polar column, temperature ramp

Column type | Active phase | I | Reference | Comment |
---|---|---|---|---|
Capillary | OV-101 | 416. | Zenkevich, 2005 | 25. m/0.20 mm/0.10 μm, N2/He, 6. K/min; Tstart: 50. C; Tend: 250. C |

Normal alkane RI, non-polar column, custom temperature program

Column type | Active phase | I | Reference | Comment |
---|---|---|---|---|
Capillary | Porapack Q | 425. | Zenkevich and Rodin, 2004 | Program: not specified |

Vibrational and/or electronic energy levels

Data compiled by: Takehiko Shimanouchi

Symmetry:   C     Symmetry Number σ = 2

 Sym.   No   Approximate   Selected Freq.  Infrared   Raman   Comments
 Species   type of mode   Value   Rating   Value  Phase  Value  Phase

a1 1 CO str 1827  B 1827 VS gas 1807 M liq.
a1 2 CBr2 s-str 567  C 567 M gas 573 VS liq.
a1 3 CBr2 deform 285  C 285 W gas 302 S liq.
b1 4 CBr2 a-str 849  B 849 S gas 832 VW liq.
b1 5 CO deform 440  C 440 M gas 442 M liq.
b2 6 Op-deform 580  C 580 M gas

Source: Shimanouchi, 1972

References

Chase, 1998
Chase, M.W., Jr.,
NIST-JANAF Themochemical Tables, Fourth Edition,
J. Phys. Chem. Ref. Data, Monograph 9, 1998, 1-1951. [all data]
Davies and Pritchard, 1972
Davies, J.V.; Pritchard, H.O.,
The enthalpy of formation of phosgene,
J. Chem. Thermodyn., 1972, 4, 23-29. [all data]
Lord and Pritchard, 1970
Lord, A.; Pritchard, H.O.,
Thermodynamics of phosgene formation from carbon monoxide and chlorine,
J. Chem. Thermodyn., 1970, 2, 187-191. [all data]
Lord and Pritchard, 1969
Lord, A.; Pritchard, H.O.,
Thermodynamics of the reaction between carbon dioxide and carbon tetrachloride,
J. Chem. Thermodyn., 1969, 1, 495-498. [all data]
Pedley, Naylor, et al., 1986
Pedley, J.B.; Naylor, R.D.; Kirby, S.P.,
Thermochemical Data of Organic Compounds, Chapman and Hall, New York, 1986, 1-792. [all data]
Giauque and Ott, 1960
Giauque, W.F.; Ott, J.B.,
The three melting points and heats of fusion of phosgene. Entropy of solids I and II, and atomic exchange disorder in solid II,
J. Am. Chem. Soc., 1960, 82, 2689-2695. [all data]
Giauque and Jones, 1948
Giauque, W.F.; Jones, W.M.,
Carbonyl chloride. Entropy. Heat capacity. Vapor pressure. Heats of fusion and vaporization. Comments on solid sulfur dioxide structure,
J. Am. Chem. Soc., 1948, 70, 120-124. [all data]
Giauque and Jones, 1948, 2
Giauque, W.F.; Jones, W.M.,
Carbonyl chloride. Entropy. Heat capacity. Vapor pressure. Heats of fusion and vaporization. Comments on solid sulfur dioxidestructure,
J. Am. Chem. Soc., 1948, 70, 120. [all data]
Stephenson and Malanowski, 1987
Stephenson, Richard M.; Malanowski, Stanislaw,
Handbook of the Thermodynamics of Organic Compounds, 1987, https://doi.org/10.1007/978-94-009-3173-2
. [all data]
Stull, 1947
Stull, Daniel R.,
Vapor Pressure of Pure Substances. Organic and Inorganic Compounds,
Ind. Eng. Chem., 1947, 39, 4, 517-540, https://doi.org/10.1021/ie50448a022
. [all data]
Larson and McMahon, 1985
Larson, J.W.; McMahon, T.B.,
Fluoride and chloride affinities of the main group oxides, fluorides, oxofluorides, and alkyls. Quantitative scales of lewis acidities from ICR halide exchange equilibria,
J. Am. Chem. Soc., 1985, 107, 766. [all data]
Thomas and Thompson, 1972
Thomas, R.K.; Thompson, H.,
Photoelectron spectra of carbonyl halides and related compounds,
Proc. R. Soc. London A:, 1972, 327, 13. [all data]
Chadwick, 1972
Chadwick, D.,
Photoelectron spectra of phosgene and thiophosgene,
Can. J. Chem., 1972, 50, 737. [all data]
Cermak, 1968
Cermak, V.,
Penning ionization electron spectroscopy. I. Determination of ionization potentials of polyatomic molecules,
Collection Czech. Chem. Commun., 1968, 33, 2739. [all data]
Johnson, Powis, et al., 1979
Johnson, K.M.; Powis, I.; Danby, C.J.,
The fragmentation of COCl2+ and COF2+ ions studied by the photoelectron-photoion coincidence technique,
Int. J. Mass Spectrom. Ion Phys., 1979, 32, 1. [all data]