2,2,2-Trifluoroethylamine
- Formula: C2H4F3N
- Molecular weight: 99.0551
- IUPAC Standard InChIKey: KIPSRYDSZQRPEA-UHFFFAOYSA-N
- CAS Registry Number: 753-90-2
- Chemical structure:

Phase change data

Data compiled by: Robert L. Brown and Stephen E. Stein
Quantity | Value | Units | Method | Reference | Comment |
---|---|---|---|---|---|
Tboil | 310.7 | K | N/A | Aldrich Chemical Company Inc., 1990 | |
Tboil | 309. | K | N/A | PCR Inc., 1990 | |
Tboil | 309.2 | K | N/A | Weast and Grasselli, 1989 |

Gas phase ion energetics data

Data evaluated as indicated in comments:
HL - Edward P. Hunter and Sharon G. Lias
Data compiled as indicated in comments:
LBLHLM - Sharon G. Lias, John E. Bartmess, Joel F. Liebman, John L. Holmes, Rhoda D. Levin, and W. Gary Mallard
LLK - Sharon G. Lias, Rhoda D. Levin, and Sherif A. Kafafi
Quantity | Value | Units | Method | Reference | Comment |
---|---|---|---|---|---|
Proton affinity (review) | 846.8 | kJ/mol | N/A | Hunter and Lias, 1998 | HL |
Quantity | Value | Units | Method | Reference | Comment |
Gas basicity | 812.9 | kJ/mol | N/A | Hunter and Lias, 1998 | HL |
Ionization energy determinations
IE (eV) | Method | Reference | Comment |
---|---|---|---|
9.97 | PE | Molder, Pikver, et al., 1983 | LBLHLM |
9.7 | PE | Aue and Bowers, 1979 | LLK |

Reaction thermochemistry data

Data compiled as indicated in comments:
B - John E. Bartmess
M - Michael M. Meot-Ner (Mautner) and Sharon G. Lias

Individual Reactions

Fluorine anion + 2,2,2-Trifluoroethylamine = (Fluorine anion • 2,2,2-Trifluoroethylamine)

By formula: F- + C2H4F3N = (F- • C2H4F3N)

Quantity Value Units Method Reference Comment
Δr118. ± 8.4kJ/molIMRELarson and McMahon, 1983gas phase; B,M
Quantity Value Units Method Reference Comment
Δr109.J/mol*KN/ALarson and McMahon, 1983gas phase; switching reaction(F-)H2O, Entropy change calculated or estimated; Arshadi, Yamdagni, et al., 1970; M
Quantity Value Units Method Reference Comment
Δr84.9 ± 8.4kJ/molIMRELarson and McMahon, 1983gas phase; B,M

Chlorine anion + 2,2,2-Trifluoroethylamine = (Chlorine anion • 2,2,2-Trifluoroethylamine)

By formula: Cl- + C2H4F3N = (Cl- • C2H4F3N)

Quantity Value Units Method Reference Comment
Δr75.3 ± 8.4kJ/molIMRELarson and McMahon, 1984gas phase; B,M
Quantity Value Units Method Reference Comment
Δr100.J/mol*KN/ALarson and McMahon, 1984gas phase; switching reaction(Cl-)CF3H, Entropy change calculated or estimated; Larson and McMahon, 1984, 2; M
Quantity Value Units Method Reference Comment
Δr45.2 ± 8.4kJ/molIMRELarson and McMahon, 1984gas phase; B,M

Iodide + 2,2,2-Trifluoroethylamine = (Iodide • 2,2,2-Trifluoroethylamine)

By formula: I- + C2H4F3N = (I- • C2H4F3N)

Quantity Value Units Method Reference Comment
Δr59.0 ± 4.2kJ/molTDAsCaldwell, Masucci, et al., 1989gas phase; B,M

Ion clustering data

Data compiled as indicated in comments:
B - John E. Bartmess
M - Michael M. Meot-Ner (Mautner) and Sharon G. Lias

Clustering reactions

Chlorine anion + 2,2,2-Trifluoroethylamine = (Chlorine anion • 2,2,2-Trifluoroethylamine)

By formula: Cl- + C2H4F3N = (Cl- • C2H4F3N)

Quantity Value Units Method Reference Comment
Δr75.3 ± 8.4kJ/molIMRELarson and McMahon, 1984gas phase; B,M
Quantity Value Units Method Reference Comment
Δr100.J/mol*KN/ALarson and McMahon, 1984gas phase; switching reaction(Cl-)CF3H, Entropy change calculated or estimated; Larson and McMahon, 1984, 2; M
Quantity Value Units Method Reference Comment
Δr45.2 ± 8.4kJ/molIMRELarson and McMahon, 1984gas phase; B,M

Fluorine anion + 2,2,2-Trifluoroethylamine = (Fluorine anion • 2,2,2-Trifluoroethylamine)

By formula: F- + C2H4F3N = (F- • C2H4F3N)

Quantity Value Units Method Reference Comment
Δr118. ± 8.4kJ/molIMRELarson and McMahon, 1983gas phase; B,M
Quantity Value Units Method Reference Comment
Δr109.J/mol*KN/ALarson and McMahon, 1983gas phase; switching reaction(F-)H2O, Entropy change calculated or estimated; Arshadi, Yamdagni, et al., 1970; M
Quantity Value Units Method Reference Comment
Δr84.9 ± 8.4kJ/molIMRELarson and McMahon, 1983gas phase; B,M

Iodide + 2,2,2-Trifluoroethylamine = (Iodide • 2,2,2-Trifluoroethylamine)

By formula: I- + C2H4F3N = (I- • C2H4F3N)

Quantity Value Units Method Reference Comment
Δr59.0 ± 4.2kJ/molTDAsCaldwell, Masucci, et al., 1989gas phase; B,M

References

Aldrich Chemical Company Inc., 1990
Aldrich Chemical Company Inc.,
Catalog Handbook of Fine Chemicals, Aldrich Chemical Company, Inc., Milwaukee WI, 1990, 1. [all data]
PCR Inc., 1990
PCR Inc.,
Research Chemicals Catalog 1990-1991, PCR Inc., Gainesville, FL, 1990, 1. [all data]
Weast and Grasselli, 1989
CRC Handbook of Data on Organic Compounds, 2nd Editon, Weast,R.C and Grasselli, J.G., ed(s)., CRC Press, Inc., Boca Raton, FL, 1989, 1. [all data]
Hunter and Lias, 1998
Hunter, E.P.; Lias, S.G.,
Evaluated Gas Phase Basicities and Proton Affinities of Molecules: An Update,
J. Phys. Chem. Ref. Data, 1998, 27, 3, 413-656, https://doi.org/10.1063/1.556018
. [all data]
Molder, Pikver, et al., 1983
Molder, U.H.; Pikver, R.J.; Koppel, I.A.,
Photoelectron spectra of molecules. 4. Amines,
Org. React. Tartu, 1983, 20, 355. [all data]
Aue and Bowers, 1979
Aue, D.H.; Bowers, M.T.,
Chapter 9. Stabilities of positive ions from equilibrium gas phase basicity measurements
in Ions Chemistry,, ed. M.T. Bowers, 1979. [all data]