Propane, 1-chloro-2,2-dimethyl-
- Formula: C5H11Cl
- Molecular weight: 106.594
- IUPAC Standard InChIKey: JEKYMVBQWWZVHO-UHFFFAOYSA-N
- CAS Registry Number: 753-89-9
- Chemical structure:
View 3d structure (requires JavaScript / HTML 5) - Other names: Neopentyl chloride; 1-Chloro-2,2-dimethylpropane; t-C4H9CH2Cl

Phase change data

Data compiled as indicated in comments:
BS - Robert L. Brown and Stephen E. Stein
TRC - Thermodynamics Research Center, NIST Boulder Laboratories, Chris Muzny director
AC - William E. Acree, Jr., James S. Chickos
Quantity | Value | Units | Method | Reference | Comment |
---|---|---|---|---|---|
Tboil | 357.5 | K | N/A | Weast and Grasselli, 1989 | BS |
Tboil | 357.15 | K | N/A | Whitmore, Pietrusza, et al., 1947 | Uncertainty assigned by TRC = 1.5 K; TRC |
Tboil | 357.55 | K | N/A | Whitmore and Fleming, 1933 | Uncertainty assigned by TRC = 0.7 K; TRC |
Quantity | Value | Units | Method | Reference | Comment |
Tfus | 253. | K | N/A | Fleming and Whitmore, 1932 | Uncertainty assigned by TRC = 4. K; TRC |
Enthalpy of vaporization
ΔvapH (kJ/mol) | Temperature (K) | Method | Reference | Comment |
---|---|---|---|---|
34.9 | 294. | A | Stephenson and Malanowski, 1987 | Based on data from 279. to 395. K. See also Dykyj, 1972.; AC |

Gas phase ion energetics data

Data compiled by: Sharon G. Lias, John E. Bartmess, Joel F. Liebman, John L. Holmes, Rhoda D. Levin, and W. Gary Mallard
Appearance energy determinations
Ion | AE (eV) | Other Products | Method | Reference | Comment |
---|---|---|---|---|---|
C4H9+ | 10.40 ± 0.05 | CH2Cl | EI | Holmes and Lossing, 1984 |

Van Den Dool and Kratz RI, non-polar column, temperature ramp

Column type | Active phase | I | Reference | Comment |
---|---|---|---|---|
Capillary | Petrocol DH | 644. | White, Hackett, et al., 1992 | 100. m/0.25 mm/0.5 μm, He, 1. K/min; Tstart: 30. C; Tend: 220. C |

Normal alkane RI, non-polar column, custom temperature program

Column type | Active phase | I | Reference | Comment |
---|---|---|---|---|
Capillary | Methyl Silicone | 654. | Zenkevich, 1999 | Program: not specified |
Capillary | Polydimethyl siloxanes | 654. | Zenkevich and Chupalov, 1996 | Program: not specified |

References

Weast and Grasselli, 1989
CRC Handbook of Data on Organic Compounds, 2nd Editon, Weast,R.C and Grasselli, J.G., ed(s)., CRC Press, Inc., Boca Raton, FL, 1989, 1. [all data]
Whitmore, Pietrusza, et al., 1947
Whitmore, F.C.; Pietrusza, E.W.; Sommer, L.H.,
Hydrogen-Halogen Exchange Reactions of Triethylsilane. A New Rearrangement of Neopentyl Chloride,
J. Am. Chem. Soc., 1947, 69, 2108. [all data]
Whitmore and Fleming, 1933
Whitmore, F.C.; Fleming, G.H.,
J. Am. Chem. Soc., 1933, 55, 4161. [all data]
Fleming and Whitmore, 1932
Fleming, G.H.; Whitmore, F.C.,
Chlorination of Neopentane,
J. Am. Chem. Soc., 1932, 54, 3460. [all data]
Stephenson and Malanowski, 1987
Stephenson, Richard M.; Malanowski, Stanislaw,
Handbook of the Thermodynamics of Organic Compounds, 1987, https://doi.org/10.1007/978-94-009-3173-2
. [all data]
Dykyj, 1972
Dykyj, J.,
Petrochemia, 1972, 12, 1, 13. [all data]
Holmes and Lossing, 1984
Holmes, J.L.; Lossing, F.P.,
Heats of formation of organic radicals from appearance energies,
Int. J. Mass Spectrom. Ion Processes, 1984, 58, 113. [all data]
White, Hackett, et al., 1992
White, C.M.; Hackett, J.; Anderson, R.R.; Kail, S.; Spock, P.S.,
Linear temperature programmed retention indices of gasoline range hydrocarbons and chlorinated hydrocarbons on cross-linked polydimethylsiloxane,
J. Hi. Res. Chromatogr., 1992, 15, 2, 105-120, https://doi.org/10.1002/jhrc.1240150211
. [all data]
Zenkevich, 1999
Zenkevich, I.G.,
Mutual Correlation between Gas-Chromatographic Retention Indices of Organic Compounds from Different Series,
Zh. Anal. Khim., 1999, 54, 12, 1272-1279. [all data]
Zenkevich and Chupalov, 1996
Zenkevich, I.G.; Chupalov, A.A.,
New Possibilities of Chromato Mass Pectrometric Identification of Organic Compounds Using Increments of Gas Chromatographic Retention Indices of Molecular Structural Fragments,
Zh. Org. Khim. (Rus.), 1996, 32, 5, 656-666. [all data]