Tin, dichlorodimethyl-
- Formula: C2H6Cl2Sn
- Molecular weight: 219.685
- IUPAC Standard InChIKey: PKKGKUDPKRTKLJ-UHFFFAOYSA-L
- CAS Registry Number: 753-73-1
- Chemical structure:

Condensed phase thermochemistry data

Data compiled by: José A. Martinho Simões
Quantity | Value | Units | Method | Reference | Comment |
---|---|---|---|---|---|
ΔfH°liquid | -79.3 ± 1.8 | kcal/mol | Review | Martinho Simões | The enthalpy of formation relies on -11.9 ± 0.48 kcal/mol for the enthalpy of formation of Sn(Me)4(l). |

Reaction thermochemistry data

Data compiled by: José A. Martinho Simões
Individual Reactions
By formula: C4H12Sn (l) + Cl4Sn (l) = 2C2H6Cl2Sn (l)
Quantity | Value | Units | Method | Reference | Comment |
---|---|---|---|---|---|
ΔrH° | -23.2 ± 3.5 | kcal/mol | RSC | Nash, Skinner, et al., 1965 | Please also see Pedley and Rylance, 1977 and Cox and Pilcher, 1970. |

Gas phase ion energetics data

Data compiled as indicated in comments:
LLK - Sharon G. Lias, Rhoda D. Levin, and Sherif A. Kafafi
Ionization energy determinations
IE (eV) | Method | Reference | Comment |
---|---|---|---|
10.43 | PE | Fragala, Ciliberto, et al., 1980 | LLK |

References

Martinho Simões
Martinho Simões, J.A.,
Private communication (see http://webbook.nist.gov/chemistry/om/). [all data]
Nash, Skinner, et al., 1965
Nash, G.A.; Skinner, H.A.; Stack, W.F.,
Trans. Faraday Soc., 1965, 61, 640. [all data]
Pedley and Rylance, 1977
Pedley, J.B.; Rylance, J.,
Computer Analysed Thermochemical Data: Organic and Organometallic Compounds, University of Sussex, Brigton, 1977. [all data]
Cox and Pilcher, 1970
Cox, J.D.; Pilcher, G.,
Thermochemistry of Organic and Organometallic Compounds
in Academic Press, New York, 1970. [all data]
Fragala, Ciliberto, et al., 1980
Fragala, I.; Ciliberto, E.; Egdell, R.G.; Granozzi, G.,
He(I) and He(II) photoelectron spectra of methyltin chlorides,
J. Chem. Soc. Dalton Trans., 1980, 145. [all data]