2-Propanethiol
- Formula: C3H8S
- Molecular weight: 76.161
- IUPAC Standard InChIKey: KJRCEJOSASVSRA-UHFFFAOYSA-N
- CAS Registry Number: 75-33-2
- Chemical structure:
View 3d structure (requires JavaScript / HTML 5) - Other names: Isopropanethiol; Isopropyl mercaptan; Isopropylthiol; 1-Methylethanethiol; 2-Mercaptopropane; 2-Propylmercaptan; iso-C3H7SH; Propanethiol-(2); 2-Propylthiol; NSC 87537; propane-2-thiol

Gas phase thermochemistry data

Data compiled by: Hussein Y. Afeefy, Joel F. Liebman, and Stephen E. Stein
Quantity | Value | Units | Method | Reference | Comment |
---|---|---|---|---|---|
ΔfH°gas | -76.94 ± 0.63 | kJ/mol | Ccr | Hubbard and Waddington, 1954 | Heat of combustion calculated author's U=-671.76 |

Condensed phase thermochemistry data

Data compiled as indicated in comments:
ALS - Hussein Y. Afeefy, Joel F. Liebman, and Stephen E. Stein
DH - Eugene S. Domalski and Elizabeth D. Hearing
Quantity | Value | Units | Method | Reference | Comment |
---|---|---|---|---|---|
ΔfH°liquid | -106.6 ± 0.63 | kJ/mol | Ccr | Hubbard and Waddington, 1954 | Heat of combustion calculated author's U=-671.76; ALS |
Quantity | Value | Units | Method | Reference | Comment |
ΔcH°liquid | -2819.3 ± 0.48 | kJ/mol | Ccr | Hubbard and Waddington, 1954 | Heat of combustion calculated author's U=-671.76; ALS |
Quantity | Value | Units | Method | Reference | Comment |
S°liquid | 233.55 | J/mol*K | N/A | McCullough, Finke, et al., 1954 | DH |
Constant pressure heat capacity of liquid
Cp,liquid (J/mol*K) | Temperature (K) | Reference | Comment |
---|---|---|---|
145.35 | 298.15 | McCullough, Finke, et al., 1954 | T = 12 to 322 K.; DH |

Phase change data

Data compiled as indicated in comments:
BS - Robert L. Brown and Stephen E. Stein
TRC - Thermodynamics Research Center, NIST Boulder Laboratories, Chris Muzny director
AC - William E. Acree, Jr., James S. Chickos
DRB - Donald R. Burgess, Jr.
ALS - Hussein Y. Afeefy, Joel F. Liebman, and Stephen E. Stein
DH - Eugene S. Domalski and Elizabeth D. Hearing
CAL - James S. Chickos, William E. Acree, Jr., Joel F. Liebman, Students of Chem 202 (Introduction to the Literature of Chemistry), University of Missouri -- St. Louis
Quantity | Value | Units | Method | Reference | Comment |
---|---|---|---|---|---|
Tboil | 328. ± 5. | K | AVG | N/A | Average of 20 values; Individual data points |
Quantity | Value | Units | Method | Reference | Comment |
Tfus | 142.61 | K | N/A | Haines, Helm, et al., 1956 | Uncertainty assigned by TRC = 0.07 K; TRC |
Tfus | 142.61 | K | N/A | Anonymous, 1954 | Uncertainty assigned by TRC = 0.06 K; TRC |
Tfus | 142.52 | K | N/A | Denyer, Fidler, et al., 1949 | Uncertainty assigned by TRC = 0.2 K; TRC |
Tfus | 142.5 | K | N/A | Ellis and Reid, 1932 | Uncertainty assigned by TRC = 0.3 K; TRC |
Quantity | Value | Units | Method | Reference | Comment |
Ttriple | 142.6300 | K | N/A | McCullough, Finke, et al., 1954, 2 | Crystal phase 1 phase; Uncertainty assigned by TRC = 0.08 K; TRC |
Ttriple | 142.6400 | K | N/A | McCullough, Finke, et al., 1954, 2 | Crystal phase 1 phase; Uncertainty assigned by TRC = 0.06 K; TRC |
Ttriple | 142.63 | K | N/A | Anonymous, 1951 | Uncertainty assigned by TRC = 0.1 K; TRC |
Quantity | Value | Units | Method | Reference | Comment |
Tc | 517.3 | K | N/A | Majer and Svoboda, 1985 | |
Quantity | Value | Units | Method | Reference | Comment |
ΔvapH° | 29.63 | kJ/mol | N/A | Majer and Svoboda, 1985 | |
ΔvapH° | 30.1 | kJ/mol | A,EB | Stephenson and Malanowski, 1987 | Based on data from 283. to 358. K. See also McCullough, Scott, et al., 1954, Osborn and Douslin, 1966, and Hubbard and Waddington, 2010.; AC |
ΔvapH° | 29.5 | kJ/mol | N/A | Reid, 1972 | AC |
ΔvapH° | 29.7 | kJ/mol | N/A | Hubbard and Waddington, 1954 | DRB |
ΔvapH° | 29.45 | kJ/mol | V | McCullough, Finke, et al., 1954, 3 | ALS |
Enthalpy of vaporization
ΔvapH (kJ/mol) | Temperature (K) | Reference | Comment |
---|---|---|---|
27.91 | 325.7 | Majer and Svoboda, 1985 | |
27.910 | 325.72 | McCullough, Finke, et al., 1954 | P = 101.325 kPa; DH |
31.9 | 257. | Dykyj, Svoboda, et al., 1999 | Based on data from 242. to 348. K.; AC |
Enthalpy of vaporization
ΔvapH =
A exp(-βTr) (1 − Tr)β
ΔvapH =
Enthalpy of vaporization (at saturation pressure)
(kJ/mol)
Tr = reduced temperature (T / Tc)
View plot Requires a JavaScript / HTML 5 canvas capable browser.
Temperature (K) | A (kJ/mol) | β | Tc (K) | Reference | Comment |
---|---|---|---|---|---|
290. to 326. | 44.41 | 0.2863 | 517.3 | Majer and Svoboda, 1985 |
Entropy of vaporization
ΔvapS (J/mol*K) | Temperature (K) | Reference | Comment |
---|---|---|---|
85.69 | 325.72 | McCullough, Finke, et al., 1954 | P; DH |
Antoine Equation Parameters
log10(P) = A − (B / (T + C))
P = vapor pressure (bar)
T = temperature (K)
View plot Requires a JavaScript / HTML 5 canvas capable browser.
Temperature (K) | A | B | C | Reference |
---|---|---|---|---|
283.84 to 358.94 | 4.00224 | 1113.895 | -46.993 | Osborn and Douslin, 1966 |
Enthalpy of fusion
ΔfusH (kJ/mol) | Temperature (K) | Reference | Comment |
---|---|---|---|
5.73 | 142.6 | Domalski and Hearing, 1996 | AC |
Entropy of fusion
ΔfusS (J/mol*K) | Temperature (K) | Reference | Comment |
---|---|---|---|
0.46 | 112.5 | Domalski and Hearing, 1996 | CAL |
40.21 | 142.6 |
Enthalpy of phase transition
ΔHtrs (kJ/mol) | Temperature (K) | Initial Phase | Final Phase | Reference | Comment |
---|---|---|---|---|---|
0.05284 | 112.5 | crystaline, II | crystaline, I | McCullough, Finke, et al., 1954 | DH |
5.736 | 142.64 | crystaline, I | liquid | McCullough, Finke, et al., 1954 | DH |
Entropy of phase transition
ΔStrs (J/mol*K) | Temperature (K) | Initial Phase | Final Phase | Reference | Comment |
---|---|---|---|---|---|
0.47 | 112.5 | crystaline, II | crystaline, I | McCullough, Finke, et al., 1954 | DH |
40.21 | 142.64 | crystaline, I | liquid | McCullough, Finke, et al., 1954 | DH |

Reaction thermochemistry data

Data compiled as indicated in comments:
B - John E. Bartmess
ALS - Hussein Y. Afeefy, Joel F. Liebman, and Stephen E. Stein
Individual Reactions
C3H7S- + =
By formula: C3H7S- + H+ = C3H8S
Quantity | Value | Units | Method | Reference | Comment |
---|---|---|---|---|---|
ΔrH° | 1479. ± 9.2 | kJ/mol | G+TS | Bartmess, Scott, et al., 1979 | gas phase; value altered from reference due to change in acidity scale; B |
Quantity | Value | Units | Method | Reference | Comment |
ΔrG° | 1452. ± 8.4 | kJ/mol | IMRE | Bartmess, Scott, et al., 1979 | gas phase; value altered from reference due to change in acidity scale; B |
By formula: H2O + C5H10OS = C2H4O2 + C3H8S
Quantity | Value | Units | Method | Reference | Comment |
---|---|---|---|---|---|
ΔrH° | -5.8 ± 0.3 | kJ/mol | Cm | Wadso, 1957 | liquid phase; Heat of hydrolysis; ALS |

Gas phase ion energetics data

Data evaluated as indicated in comments:
HL - Edward P. Hunter and Sharon G. Lias
L - Sharon G. Lias
Data compiled as indicated in comments:
B - John E. Bartmess
LBLHLM - Sharon G. Lias, John E. Bartmess, Joel F. Liebman, John L. Holmes, Rhoda D. Levin, and W. Gary Mallard
LLK - Sharon G. Lias, Rhoda D. Levin, and Sherif A. Kafafi
RDSH - Henry M. Rosenstock, Keith Draxl, Bruce W. Steiner, and John T. Herron
Quantity | Value | Units | Method | Reference | Comment |
---|---|---|---|---|---|
IE (evaluated) | 9.15 | eV | N/A | N/A | L |
Quantity | Value | Units | Method | Reference | Comment |
Proton affinity (review) | 803.6 | kJ/mol | N/A | Hunter and Lias, 1998 | HL |
Quantity | Value | Units | Method | Reference | Comment |
Gas basicity | 772.3 | kJ/mol | N/A | Hunter and Lias, 1998 | HL |
Ionization energy determinations
IE (eV) | Method | Reference | Comment |
---|---|---|---|
9.15 | PI | Traeger, 1984 | LBLHLM |
9.14 | PE | Ogata, Onizuka, et al., 1973 | LLK |
Appearance energy determinations
Ion | AE (eV) | Other Products | Method | Reference | Comment |
---|---|---|---|---|---|
C2H5S+ | 11.0 ± 0.15 | CH3 | EI | Broer, Weringa, et al., 1979 | LLK |
C2H5S+ | 10.7 ± 0.1 | CH3 | EI | Keyes and Harrson, 1968 | RDSH |
C3H7+ | 10.35 | SH | PI | Traeger, 1984 | LBLHLM |
De-protonation reactions
C3H7S- + =
By formula: C3H7S- + H+ = C3H8S
Quantity | Value | Units | Method | Reference | Comment |
---|---|---|---|---|---|
ΔrH° | 1479. ± 9.2 | kJ/mol | G+TS | Bartmess, Scott, et al., 1979 | gas phase; value altered from reference due to change in acidity scale; B |
Quantity | Value | Units | Method | Reference | Comment |
ΔrG° | 1452. ± 8.4 | kJ/mol | IMRE | Bartmess, Scott, et al., 1979 | gas phase; value altered from reference due to change in acidity scale; B |

Kovats' RI, non-polar column, isothermal

Column type | Active phase | Temperature (C) | I | Reference | Comment |
---|---|---|---|---|---|
Capillary | DB-5 | 100. | 572.1 | Miller and Bruno, 2003 | 30. m/0.25 mm/0.1 μm |
Capillary | DB-5 | 120. | 581.7 | Miller and Bruno, 2003 | 30. m/0.25 mm/0.1 μm |
Capillary | DB-5 | 60. | 565.9 | Miller and Bruno, 2003 | 30. m/0.25 mm/0.1 μm |
Capillary | DB-5 | 80. | 569.0 | Miller and Bruno, 2003 | 30. m/0.25 mm/0.1 μm |
Packed | Apiezon M | 130. | 566. | Garbuzov, Misharina, et al., 1985 | He or N2, Chromosorb W, AW-DMCS; Column length: 2.1 m |
Packed | Apiezon M | 60. | 555. | Mikhailova, Gren, et al., 1985 | Chromosorb WAW; Column length: 2.1 m |
Packed | Squalane | 60. | 537. | Zygmunt and Staszewski, 1981 | Chromosorb W DMCS; Column length: 2. m |
Packed | Squalane | 80. | 540. | Zygmunt and Staszewski, 1981 | Chromosorb W DMCS; Column length: 2. m |
Packed | Apiezon M | 130. | 566. | Golovnya and Garbuzov, 1974 | N2, Chromosorb W; Column length: 2.1 m |

Kovats' RI, non-polar column, custom temperature program

Column type | Active phase | I | Reference | Comment |
---|---|---|---|---|
Capillary | Apiezon M | 566. | Zhu, Wang, et al., 2007 | Program: not specified |

Kovats' RI, polar column, custom temperature program

Column type | Active phase | I | Reference | Comment |
---|---|---|---|---|
Capillary | PEG-20M | 773. | Zhu, Wang, et al., 2007 | Program: not specified |

Normal alkane RI, non-polar column, isothermal

Column type | Active phase | Temperature (C) | I | Reference | Comment |
---|---|---|---|---|---|
Capillary | Polydimethyl siloxane with 5 % Ph groups | 100. | 572. | Safa and Hadjmohannadi, 2005 | 30. m/0.25 mm/0.10 μm, Nitrogen |
Capillary | Polydimethyl siloxane with 5 % Ph groups | 60. | 570. | Safa and Hadjmohannadi, 2005 | 30. m/0.25 mm/0.10 μm, Nitrogen |
Capillary | Polydimethyl siloxane with 5 % Ph groups | 80. | 569. | Safa and Hadjmohannadi, 2005 | 30. m/0.25 mm/0.10 μm, Nitrogen |

Normal alkane RI, non-polar column, temperature ramp

Column type | Active phase | I | Reference | Comment |
---|---|---|---|---|
Capillary | PONA | 539. | Yang, Wang, et al., 2004 | 50. m/0.20 mm/0.50 μm, N2, 2. K/min; Tstart: 35. C; Tend: 170. C |
Capillary | PONA | 562. | Yang, Yang, et al., 2003 | 50. m/0.20 mm/0.50 μm, Helium, 2. K/min; Tstart: 30. C; Tend: 170. C |

Normal alkane RI, non-polar column, custom temperature program

Column type | Active phase | I | Reference | Comment |
---|---|---|---|---|
Capillary | HP-5 | 550. | Rotsatschakul, Visesanguan, et al., 2009 | 60. m/0.25 mm/0.25 μm, Helium; Program: 30 0C (2 min) 2 0Cmin -> 60 0C 10 0C/min -> 100 0C 20 0C/min -> 140 0C 10 0C/min -> 200 0C (10 min) |
Capillary | Polydimethyl siloxanes | 522. | Zenkevich, 1998 | Program: not specified |

References

Hubbard and Waddington, 1954
Hubbard, W.N.; Waddington, G.,
The heat of combustion, formation and isomerization of propanethiol-1, propane-thiol-2 and 2-thiabutane,
Rec. Trav. Chim. Pays/Bas, 1954, 73, 910. [all data]
McCullough, Finke, et al., 1954
McCullough, J.P.; Finke, H.L.; Gross, M.E.; Messerly, J.F.; Pennington, R.E.; Waddington, G.,
2-Propanethiol: experimental thermodynamic studies from 12 to 500 K. The chemical thermodynamic properties from 0 to 1000 K,
J. Am. Chem. Soc., 1954, 76, 4796-4802. [all data]
Haines, Helm, et al., 1956
Haines, W.E.; Helm, R.V.; Cook, G.L.; Ball, J.S.,
Purification and Properties of Organic Sulfur Compounds,
J. Phys. Chem., 1956, 60, 549-55. [all data]
Anonymous, 1954
Anonymous, R.,
, Am. Pet. Inst. Res. Proj. 45, Tech. Rep. 13, Ohio State Univ., 1954. [all data]
Denyer, Fidler, et al., 1949
Denyer, R.L.; Fidler, F.A.; Lowry, R.A.,
Azeotrope Formation Between Thiols and Hydrocarbons,
Ind. Eng. Chem., 1949, 41, 2727-37. [all data]
Ellis and Reid, 1932
Ellis, L.M.; Reid, E.E.,
The Preparation and Properties of A Double Series of Aliphatic Mercaptans,
J. Am. Chem. Soc., 1932, 54, 1674. [all data]
McCullough, Finke, et al., 1954, 2
McCullough, J.P.; Finke, H.L.; Scott, D.W.; Gross, M.E.; Messerly, J.F.; Pennington, R.E.; Waddington, G.,
2-Propanethiol: Experimental Thermodynamic Studies from 12 to 500 K. The Chemical Thermodynamic Properties from 0 to 1000 K,
J. Am. Chem. Soc., 1954, 76, 4796-802. [all data]
Anonymous, 1951
Anonymous, R.,
, Sunbury Rep. No. 4199, Anglo-Iranian Oil Co., 1951. [all data]
Majer and Svoboda, 1985
Majer, V.; Svoboda, V.,
Enthalpies of Vaporization of Organic Compounds: A Critical Review and Data Compilation, Blackwell Scientific Publications, Oxford, 1985, 300. [all data]
Stephenson and Malanowski, 1987
Stephenson, Richard M.; Malanowski, Stanislaw,
Handbook of the Thermodynamics of Organic Compounds, 1987, https://doi.org/10.1007/978-94-009-3173-2
. [all data]
McCullough, Scott, et al., 1954
McCullough, J.P.; Scott, D.W.; Pennington, R.E.; Hossenlopp, I.A.; Waddington, Guy,
Nitromethane: The Vapor Heat Capacity, Heat of Vaporization, Vapor Pressure and Gas Imperfection; the Chemical Thermodynamic Properties from 0 to 1500°K.,
J. Am. Chem. Soc., 1954, 76, 19, 4791-4796, https://doi.org/10.1021/ja01648a008
. [all data]
Osborn and Douslin, 1966
Osborn, A.G.; Douslin, D.R.,
Vapor Pressure Relations of 36 Sulfur Compounds Present in Petroleum.,
J. Chem. Eng. Data, 1966, 11, 4, 502-509, https://doi.org/10.1021/je60031a014
. [all data]
Hubbard and Waddington, 2010
Hubbard, Ward N.; Waddington, Guy,
The heats of combustion, formation and isomerization of propanethiol-1, propane-thiol-2 and 2-thiabutane,
Recl. Trav. Chim. Pays-Bas, 2010, 73, 11, 910-923, https://doi.org/10.1002/recl.19540731107
. [all data]
Reid, 1972
Reid, Robert C.,
Handbook on vapor pressure and heats of vaporization of hydrocarbons and related compounds, R. C. Wilhort and B. J. Zwolinski, Texas A Research Foundation. College Station, Texas(1971). 329 pages.$10.00,
AIChE J., 1972, 18, 6, 1278-1278, https://doi.org/10.1002/aic.690180637
. [all data]
McCullough, Finke, et al., 1954, 3
McCullough, J.P.; Finke, H.L.; Scott, D.W.; Gross, M.E.; Messerly, J.F.; Pennington, R.E.; Waddington, G.,
2-Propanethiol: Experimental thermodynamic studies from 12 to 500°K. The chemical thermodynamic properties from 0 to 1000°K,
J. Am. Chem. Soc., 1954, 76, 4796-48. [all data]
Dykyj, Svoboda, et al., 1999
Dykyj, J.; Svoboda, J.; Wilhoit, R.C.; Frenkel, M.L.; Hall, K.R.,
Vapor Pressure of Chemicals: Part A. Vapor Pressure and Antoine Constants for Hydrocarbons and Sulfur, Selenium, Tellurium and Hydrogen Containing Organic Compounds, Springer, Berlin, 1999, 373. [all data]
Domalski and Hearing, 1996
Domalski, Eugene S.; Hearing, Elizabeth D.,
Heat Capacities and Entropies of Organic Compounds in the Condensed Phase. Volume III,
J. Phys. Chem. Ref. Data, 1996, 25, 1, 1, https://doi.org/10.1063/1.555985
. [all data]
Bartmess, Scott, et al., 1979
Bartmess, J.E.; Scott, J.A.; McIver, R.T., Jr.,
The gas phase acidity scale from methanol to phenol,
J. Am. Chem. Soc., 1979, 101, 6047. [all data]
Wadso, 1957
Wadso, I.,
The heats of hydrolysis of some alkyl thiolesters,
Acta Chem. Scand., 1957, 11, 1745-1751. [all data]
Hunter and Lias, 1998
Hunter, E.P.; Lias, S.G.,
Evaluated Gas Phase Basicities and Proton Affinities of Molecules: An Update,
J. Phys. Chem. Ref. Data, 1998, 27, 3, 413-656, https://doi.org/10.1063/1.556018
. [all data]
Traeger, 1984
Traeger, J.C.,
Heat of formation for the SH radical by photoionization mass spectrometry,
Org. Mass Spectrom., 1984, 19, 514. [all data]
Ogata, Onizuka, et al., 1973
Ogata, H.; Onizuka, H.; Nihei, Y.; Kamada, H.,
The photoelectron spectra of alcohols, mercaptans and amines,
Bull. Chem. Soc. Jpn., 1973, 46, 3036. [all data]
Broer, Weringa, et al., 1979
Broer, W.J.; Weringa, W.D.; Nieuwpoort, W.C.,
Rearrangements and fragmentations of [C2H5S]+ ions,
Org. Mass Spectrom., 1979, 14, 543. [all data]
Keyes and Harrson, 1968
Keyes, B.G.; Harrson, A.G.,
The fragmentation of aliphatic sulfur compounds by electron impact,
J. Am. Chem. Soc., 1968, 90, 5671. [all data]
Miller and Bruno, 2003
Miller, K.E.; Bruno, T.J.,
Isothermal Kováts retention indices of sulfur compounds on a poly(5% diphenyl-95% dimethylsiloxane) stationary phase,
J. Chromatogr. A, 2003, 1007, 1-2, 117-125, https://doi.org/10.1016/S0021-9673(03)00958-0
. [all data]
Garbuzov, Misharina, et al., 1985
Garbuzov, V.G.; Misharina, T.A.; Aerov, A.F.; Golovnya, R.V.,
Gas chromatographic retention indices for sulphur(II)-containing organic substances,
J. Anal. Chem. USSR (Engl. Transl.), 1985, 40, 4, 576-586. [all data]
Mikhailova, Gren, et al., 1985
Mikhailova, T.V.; Gren, A.I.; Vysotskaja, L.E.; Misharina, T.A.; Vitt, S.V.; Golovnya, R.V.,
Identification of sulphur-organic compounds obtained by thermal treatment of the meat broths in the presence of alkyl-mercaptopropanol,
Nahrung, 1985, 29, 7, 671-680, https://doi.org/10.1002/food.19850290705
. [all data]
Zygmunt and Staszewski, 1981
Zygmunt, B.; Staszewski, R.,
Retention index and gas chromatographic-mass spectrometric identification of thiols in liquified gas,
Chem. Anal. (Warsaw), 1981, 26, 109-113. [all data]
Golovnya and Garbuzov, 1974
Golovnya, R.V.; Garbuzov, V.G.,
Effect of heteroatom in aliphatic sulfur- and oxygen-containing compounds on the values of the retention indices in gas chromatography,
Izv. Akad. Nauk SSSR Ser. Khim., 1974, 7, 1519-1521. [all data]
Zhu, Wang, et al., 2007
Zhu, X.H.; Wang, W.; Schramm, K.-W.; Niu, W.,
Prediction of the Kova´ ts Retention Indices of Thiols by Use of Quantum Chemical and Physicochemical Descriptors,
Chromatographia, 2007, 65, 11-12, 719-724, https://doi.org/10.1365/s10337-007-0237-3
. [all data]
Safa and Hadjmohannadi, 2005
Safa, F.; Hadjmohannadi, M.R.,
Use of topological indices of organic sulfur compounds in quantitative structure-retention relationship study,
QSAR Comb. Sci., 2005, 24, 9, 1026-1032, https://doi.org/10.1002/qsar.200530008
. [all data]
Yang, Wang, et al., 2004
Yang, Y.; Wang, Z.; Zong, B.; Yang, H.,
Determination of sulfur compounds in fluid catalytic cracking gasoline by gas chromatography with a sulfur chemiluminiscence detector,
Chin. J. Chromatogr., 2004, 22, 3, 216-219. [all data]
Yang, Yang, et al., 2003
Yang, Y.T.; Yang, H.Y.; Zong, B.N.; Lu, W.Z.,
determination and distribution of sulfur compounds in gasoline by gas chromatography-atomic emission detector,
Chinise J. Anal. Chem. (Fenxi Huaxue), 2003, 31, 10, 1153-1158. [all data]
Rotsatschakul, Visesanguan, et al., 2009
Rotsatschakul, P.; Visesanguan, W.; Smitinont, T.; Chaiseri, S.,
Changes in volatile compounds during fermentation of nham (Thai fermented sausage),
Int. Food Res. J., 2009, 16, 391-414. [all data]
Zenkevich, 1998
Zenkevich, I.G.,
The Principle of Structural Analogy in the Calculation of Gas Chromatographic Retention Indices using Physico-Chemical Constants of Organic Compounds,
Zh. Anal. Khim. (Rus.), 1998, 53, 1, 43-49. [all data]