Propane, 2-chloro-
- Formula: C3H7Cl
- Molecular weight: 78.541
- IUPAC Standard InChIKey: ULYZAYCEDJDHCC-UHFFFAOYSA-N
- CAS Registry Number: 75-29-6
- Chemical structure:
View 3d structure (requires JavaScript / HTML 5) - Other names: Isopropyl chloride; Isoprid; Narcosop; 2-Chloropropane; 2-Propyl chloride; iso-C3H7Cl; UN 2356; sec-Propyl chloride; Chlorodimethylmethane

Gas phase thermochemistry data

Data compiled by: Hussein Y. Afeefy, Joel F. Liebman, and Stephen E. Stein
Quantity | Value | Units | Method | Reference | Comment |
---|---|---|---|---|---|
ΔfH°gas | -144. ± 5. | kJ/mol | AVG | N/A | Average of 6 values; Individual data points |
Quantity | Value | Units | Method | Reference | Comment |
ΔcH°gas | -2059.6 ± 0.79 | kJ/mol | Ccb | Fletcher and Pilcher, 1971 |

Condensed phase thermochemistry data

Data compiled by: Hussein Y. Afeefy, Joel F. Liebman, and Stephen E. Stein
Quantity | Value | Units | Method | Reference | Comment |
---|---|---|---|---|---|
ΔcH°liquid | -2028.4 ± 8.4 | kJ/mol | Ccb | Smith, Bjellerup, et al., 1953 | Reanalyzed by Cox and Pilcher, 1970, Original value = -2023.9 kJ/mol |

Phase change data

Data compiled as indicated in comments:
BS - Robert L. Brown and Stephen E. Stein
TRC - Thermodynamics Research Center, NIST Boulder Laboratories, Chris Muzny director
AC - William E. Acree, Jr., James S. Chickos
ALS - Hussein Y. Afeefy, Joel F. Liebman, and Stephen E. Stein
Quantity | Value | Units | Method | Reference | Comment |
---|---|---|---|---|---|
Tboil | 308. ± 2. | K | AVG | N/A | Average of 11 values; Individual data points |
Quantity | Value | Units | Method | Reference | Comment |
Tfus | 155.97 | K | N/A | Dreisbach, 1955 | Uncertainty assigned by TRC = 0.02 K; TRC |
Tfus | 156.15 | K | N/A | Timmermans and Martin, 1928 | Uncertainty assigned by TRC = 0.5 K; TRC |
Quantity | Value | Units | Method | Reference | Comment |
ΔvapH° | 27.6 | kJ/mol | N/A | Djkyj, Paulech, et al., 1960 | Based on data from 271. to 312. K.; AC |
Enthalpy of vaporization
ΔvapH (kJ/mol) | Temperature (K) | Method | Reference | Comment |
---|---|---|---|---|
30.2 | 254. | A | Stephenson and Malanowski, 1987 | Based on data from 239. to 310. K.; AC |
30.6 | 209. | N/A | Stull, 1947 | Based on data from 194. to 309. K.; AC |
27.2 ± 0.84 | 307. | V | Mathews and Fehlandt, 1931 | Reanalyzed by Pedley, Naylor, et al., 1986, Original value = 26.5 kJ/mol; ALS |
27.3 | 288. | N/A | Rex, 1906 | Based on data from 273. to 303. K. See also Boublik, Fried, et al., 1984.; AC |
Antoine Equation Parameters
log10(P) = A − (B / (T + C))
P = vapor pressure (bar)
T = temperature (K)
View plot Requires a JavaScript / HTML 5 canvas capable browser.
Temperature (K) | A | B | C | Reference | Comment |
---|---|---|---|---|---|
194.3 to 309.7 | 3.81944 | 1022.222 | -41.619 | Stull, 1947 | Coefficents calculated by NIST from author's data. |
273. to 303. | 4.9762 | 1631.7 | 19.836 | Rex, 1906, 2 | Coefficents calculated by NIST from author's data. |
Enthalpy of fusion
ΔfusH (kJ/mol) | Temperature (K) | Reference | Comment |
---|---|---|---|
7.39 | 156. | Acree, 1991 | AC |

Reaction thermochemistry data

Data compiled as indicated in comments:
ALS - Hussein Y. Afeefy, Joel F. Liebman, and Stephen E. Stein
B - John E. Bartmess
M - Michael M. Meot-Ner (Mautner) and Sharon G. Lias
Individual Reactions
By formula: C3H7Cl = C3H6 + HCl
Quantity | Value | Units | Method | Reference | Comment |
---|---|---|---|---|---|
ΔrH° | 72.4 ± 0.8 | kJ/mol | Eqk | Noren and Sunner, 1970 | gas phase; ALS |
ΔrH° | 73.72 ± 0.63 | kJ/mol | Eqk | Kabo and Andreevskii, 1963 | gas phase; At 415.5 K; ALS |
ΔrH° | 73.0 ± 2.1 | kJ/mol | Eqk | Howlett, 1955 | gas phase; ALS |
By formula: Cl- + C3H7Cl = (Cl- • C3H7Cl)
Quantity | Value | Units | Method | Reference | Comment |
---|---|---|---|---|---|
ΔrH° | 61.5 ± 4.2 | kJ/mol | TDAs | Li, Ross, et al., 1996 | gas phase; B |
Quantity | Value | Units | Method | Reference | Comment |
ΔrG° | 32.6 ± 0.84 | kJ/mol | TDAs | Li, Ross, et al., 1996 | gas phase; B |
By formula: Br- + C3H7Cl = (Br- • C3H7Cl)
Quantity | Value | Units | Method | Reference | Comment |
---|---|---|---|---|---|
ΔrH° | 51.9 ± 4.2 | kJ/mol | TDAs | Li, Ross, et al., 1996 | gas phase; B |
Quantity | Value | Units | Method | Reference | Comment |
ΔrG° | 26.2 ± 0.84 | kJ/mol | TDAs | Li, Ross, et al., 1996 | gas phase; B |
By formula: CH3+ + C3H7Cl = (CH3+ • C3H7Cl)
Quantity | Value | Units | Method | Reference | Comment |
---|---|---|---|---|---|
ΔrH° | 320. | kJ/mol | PHPMS | Sharma, Meza de Hojer, et al., 1985 | gas phase; from i-C3H7+ + CH3Cl; Cox and Pilcher, 1970, 2, Rosenstock, Buff, et al., 1982, Sen Sharma and Kebarle, 1978; M |
By formula: Li+ + C3H7Cl = (Li+ • C3H7Cl)
Quantity | Value | Units | Method | Reference | Comment |
---|---|---|---|---|---|
ΔrH° | 130. | kJ/mol | ICR | Staley and Beauchamp, 1975 | gas phase; switching reaction(Li+)H2O, from graph; Dzidic and Kebarle, 1970 extrapolated; M |
By formula: C3H7Cl = C3H7Cl
Quantity | Value | Units | Method | Reference | Comment |
---|---|---|---|---|---|
ΔrH° | -12.7 ± 0.8 | kJ/mol | Eqk | Kabo and Andreevskii, 1965 | gas phase; Correction by Andreevskii, 1972; ALS |
By formula: H2 + C3H7Cl = C3H8 + HCl
Quantity | Value | Units | Method | Reference | Comment |
---|---|---|---|---|---|
ΔrH° | -58.32 ± 0.71 | kJ/mol | Chyd | Davies, Lacher, et al., 1965 | gas phase; ALS |
By formula: C3H6 + HCl = C3H7Cl
Quantity | Value | Units | Method | Reference | Comment |
---|---|---|---|---|---|
ΔrH° | -73.39 | kJ/mol | Eqk | Kabo and Andreevskii, 1963 | gas phase; At 385°K; ALS |

Henry's Law data

Data compiled by: Rolf Sander
Henry's Law constant (water solution)
kH(T) = k°H exp(d(ln(kH))/d(1/T) ((1/T) - 1/(298.15 K)))
k°H = Henry's law constant for solubility in water at 298.15 K (mol/(kg*bar))
d(ln(kH))/d(1/T) = Temperature dependence constant (K)
k°H (mol/(kg*bar)) | d(ln(kH))/d(1/T) (K) | Method | Reference | Comment |
---|---|---|---|---|
0.068 | Q | N/A | missing citation give several references for the Henry's law constants but don't assign them to specific species. Value at T = 293. K. | |
0.062 | V | N/A |

Gas phase ion energetics data

Data evaluated as indicated in comments:
L - Sharon G. Lias
Data compiled as indicated in comments:
LL - Sharon G. Lias and Joel F. Liebman
LLK - Sharon G. Lias, Rhoda D. Levin, and Sherif A. Kafafi
RDSH - Henry M. Rosenstock, Keith Draxl, Bruce W. Steiner, and John T. Herron
Quantity | Value | Units | Method | Reference | Comment |
---|---|---|---|---|---|
IE (evaluated) | 10.78 ± 0.02 | eV | N/A | N/A | L |
Ionization energy determinations
IE (eV) | Method | Reference | Comment |
---|---|---|---|
10.75 | EST | Luo and Pacey, 1992 | LL |
10.81 | PE | Kimura, Katsumata, et al., 1981 | LLK |
10.78 | PI | Traeger, 1980 | LLK |
11.0 ± 0.1 | EI | Gross, 1972 | LLK |
10.77 ± 0.03 | EI | Baldwin, Maccoll, et al., 1964 | RDSH |
10.78 ± 0.02 | PI | Watanabe, Nakayama, et al., 1962 | RDSH |
Appearance energy determinations
Ion | AE (eV) | Other Products | Method | Reference | Comment |
---|---|---|---|---|---|
CH3+ | 29.7 ± 0.2 | ? | EI | Olmsted, Street, et al., 1964 | RDSH |
C3H5+ | 12.58 | H2+Cl | PI | Traeger, 1980 | LLK |
C3H6+ | 13.3 ± 0.03 | HCl | EI | Maccoll and Mathur, 1980 | LLK |
C3H6+ | 10.3 | HCl | EI | Baldwin, Maccoll, et al., 1966 | RDSH |
C3H7+ | 10.92 | Cl | PI | Traeger, 1980 | LLK |
C3H7+ | 11.3 ± 0.1 | Cl | EI | Gross, 1972 | LLK |
C3H7+ | 10.99 ± 0.05 | Cl | EI | Baldwin, Maccoll, et al., 1966 | RDSH |

Ion clustering data

Data compiled as indicated in comments:
B - John E. Bartmess
M - Michael M. Meot-Ner (Mautner) and Sharon G. Lias
Clustering reactions
By formula: Br- + C3H7Cl = (Br- • C3H7Cl)
Quantity | Value | Units | Method | Reference | Comment |
---|---|---|---|---|---|
ΔrH° | 51.9 ± 4.2 | kJ/mol | TDAs | Li, Ross, et al., 1996 | gas phase; B |
Quantity | Value | Units | Method | Reference | Comment |
ΔrG° | 26.2 ± 0.84 | kJ/mol | TDAs | Li, Ross, et al., 1996 | gas phase; B |
By formula: CH3+ + C3H7Cl = (CH3+ • C3H7Cl)
Quantity | Value | Units | Method | Reference | Comment |
---|---|---|---|---|---|
ΔrH° | 320. | kJ/mol | PHPMS | Sharma, Meza de Hojer, et al., 1985 | gas phase; from i-C3H7+ + CH3Cl; Cox and Pilcher, 1970, 2, Rosenstock, Buff, et al., 1982, Sen Sharma and Kebarle, 1978; M |
By formula: Cl- + C3H7Cl = (Cl- • C3H7Cl)
Quantity | Value | Units | Method | Reference | Comment |
---|---|---|---|---|---|
ΔrH° | 61.5 ± 4.2 | kJ/mol | TDAs | Li, Ross, et al., 1996 | gas phase; B |
Quantity | Value | Units | Method | Reference | Comment |
ΔrG° | 32.6 ± 0.84 | kJ/mol | TDAs | Li, Ross, et al., 1996 | gas phase; B |
By formula: Li+ + C3H7Cl = (Li+ • C3H7Cl)
Quantity | Value | Units | Method | Reference | Comment |
---|---|---|---|---|---|
ΔrH° | 130. | kJ/mol | ICR | Staley and Beauchamp, 1975 | gas phase; switching reaction(Li+)H2O, from graph; Dzidic and Kebarle, 1970 extrapolated; M |

Kovats' RI, non-polar column, isothermal

Column type | Active phase | Temperature (C) | I | Reference | Comment |
---|---|---|---|---|---|
Packed | Squalane | 80. | 479. | Pacáková, Vojtechová, et al., 1988 | N2, Chezasorb AW-HMDS; Column length: 1.2 m |
Packed | Squalane | 27. | 475. | Hively and Hinton, 1968 | He, Chromosorb P; Column length: 15. m; Column diameter: 0.25 mm |
Packed | Squalane | 49. | 477. | Hively and Hinton, 1968 | He, Chromosorb P; Column length: 15. m; Column diameter: 0.25 mm |
Packed | Squalane | 67. | 478. | Hively and Hinton, 1968 | He, Chromosorb P; Column length: 15. m; Column diameter: 0.25 mm |
Packed | Squalane | 86. | 480. | Hively and Hinton, 1968 | He, Chromosorb P; Column length: 15. m; Column diameter: 0.25 mm |
Packed | Apiezon L | 130. | 490. | von Kováts, 1958 | Celite (40:60 Gewichtsverhaltnis) |
Packed | Apiezon L | 70. | 488. | von Kováts, 1958 | Celite (40:60 Gewichtsverhaltnis) |

Van Den Dool and Kratz RI, non-polar column, temperature ramp

Column type | Active phase | I | Reference | Comment |
---|---|---|---|---|
Capillary | Petrocol DH | 490.72 | White, Douglas, et al., 1992 | 100. m/0.25 mm/0.5 μm, He, 1. K/min; Tstart: 30. C; Tend: 220. C |
Capillary | Petrocol DH | 491.4 | White, Douglas, et al., 1992 | 100. m/0.25 mm/0.5 μm, He, 1. K/min; Tstart: 30. C; Tend: 220. C |
Capillary | Petrocol DH | 491. | White, Hackett, et al., 1992 | 100. m/0.25 mm/0.5 μm, He, 1. K/min; Tstart: 30. C; Tend: 220. C |

Normal alkane RI, non-polar column, isothermal

Column type | Active phase | Temperature (C) | I | Reference | Comment |
---|---|---|---|---|---|
Capillary | Apiezon L | 130. | 507. | Arruda, Junkes, et al., 2008 |

Normal alkane RI, non-polar column, temperature ramp

Column type | Active phase | I | Reference | Comment |
---|---|---|---|---|
Capillary | SE-54 | 477. | Huang, Liang, et al., 1996 | 36. m/0.25 mm/0.25 μm, 5. K/min; Tstart: 35. C; Tend: 240. C |

Normal alkane RI, non-polar column, custom temperature program

Column type | Active phase | I | Reference | Comment |
---|---|---|---|---|
Capillary | Polydimethyl siloxanes | 496. | Zenkevich, 2003 | Program: not specified |
Capillary | Methyl Silicone | 496. | Zenkevich, 2001 | Program: not specified |
Capillary | Methyl Silicone | 496. | Zenkevich, 1999 | Program: not specified |
Capillary | Methyl Silicone | 496. | Zenkevich, 1998 | Program: not specified |
Capillary | Polydimethyl siloxanes | 496. | Zenkevich and Chupalov, 1996 | Program: not specified |
Capillary | Polydimethyl siloxanes | 496. | Zenkevich and Chupalov, 1996 | Program: not specified |
Capillary | OV-1, SE-30, Methyl silicone, SP-2100, OV-101, DB-1, etc. | 495. | Waggott and Davies, 1984 | Hydrogen; Column length: 50. m; Column diameter: 0.32 mm; Program: not specified |

References

Fletcher and Pilcher, 1971
Fletcher, R.A.; Pilcher, G.,
Measurements of heats of combustion by flame calorimetry. Part 7.-Chloromethane, chloroethane, 1-chloropropane, 2-chloropropane,
Trans. Faraday Soc., 1971, 67, 3191-3201. [all data]
Smith, Bjellerup, et al., 1953
Smith, L.; Bjellerup, L.; Krook, S.; Westermark, H.,
Heats of combustion of organic chloro compounds determined by the "quartz wool" method,
Acta Chem. Scand., 1953, 7, 65. [all data]
Cox and Pilcher, 1970
Cox, J.D.; Pilcher, G.,
Thermochemistry of Organic and Organometallic Compounds, Academic Press, New York, 1970, 1-636. [all data]
Dreisbach, 1955
Dreisbach, R.R.,
Physical Properties of Chemical Compounds, Advances in Chemistry Series No. 15, Am. Chem. Soc.: Washington, D. C., 1955. [all data]
Timmermans and Martin, 1928
Timmermans, J.; Martin, F.,
Study of the Physical Constants of Twenty Organic Compounds of the Physical Constants of Twenty Organic Compounds,
J. Chim. Phys. Phys.-Chim. Biol., 1928, 25, 411. [all data]
Djkyj, Paulech, et al., 1960
Djkyj, J.; Paulech, J.; Seprakova, M.,
Chem. Zvesti, 1960, 14, 327. [all data]
Stephenson and Malanowski, 1987
Stephenson, Richard M.; Malanowski, Stanislaw,
Handbook of the Thermodynamics of Organic Compounds, 1987, https://doi.org/10.1007/978-94-009-3173-2
. [all data]
Stull, 1947
Stull, Daniel R.,
Vapor Pressure of Pure Substances. Organic and Inorganic Compounds,
Ind. Eng. Chem., 1947, 39, 4, 517-540, https://doi.org/10.1021/ie50448a022
. [all data]
Mathews and Fehlandt, 1931
Mathews, J.H.; Fehlandt, P.R.,
The heats of vaporization of some organic compounds,
J. Am. Chem. Soc., 1931, 53, 3212-32. [all data]
Pedley, Naylor, et al., 1986
Pedley, J.B.; Naylor, R.D.; Kirby, S.P.,
Thermochemical Data of Organic Compounds, Chapman and Hall, New York, 1986, 1-792. [all data]
Rex, 1906
Rex, A.,
Z. Phys. Chem., Stoechiom. Verwandtschaftsl., 1906, 55, 355. [all data]
Boublik, Fried, et al., 1984
Boublik, T.; Fried, V.; Hala, E.,
The Vapour Pressures of Pure Substances: Selected Values of the Temperature Dependence of the Vapour Pressures of Some Pure Substances in the Normal and Low Pressure Region, 2nd ed., Elsevier, New York, 1984, 972. [all data]
Rex, 1906, 2
Rex, A.,
Uber die Loslichkeit der Halogenderivate der Kohlenwasserstoffe in Wasser,
Z. Phys. Chem. (Frankfurt/Main), 1906, 55, 355-370. [all data]
Acree, 1991
Acree, William E.,
Thermodynamic properties of organic compounds: enthalpy of fusion and melting point temperature compilation,
Thermochimica Acta, 1991, 189, 1, 37-56, https://doi.org/10.1016/0040-6031(91)87098-H
. [all data]
Noren and Sunner, 1970
Noren, I.; Sunner, S.,
The enthalpy of formation of 2-chloropropane from equilibrium studies,
J. Chem. Thermodyn., 1970, 2, 597-602. [all data]
Kabo and Andreevskii, 1963
Kabo, G.Ya.; Andreevskii, D.N.,
Equilibrium of 2-chloropropane dehydrochlorination,
Neftekhimiya, 1963, 3, 764-770. [all data]
Howlett, 1955
Howlett, K.E.,
The use of equilibrium constants to calculate thermodynamic quantities. Part II,
J. Chem. Soc., 1955, 1784-17. [all data]
Li, Ross, et al., 1996
Li, C.; Ross, P.; Szulejko, J.; McMahon, T.B.,
High-Pressure Mass Spectrometric Investigations of the Potential Energy Surfaces of Gas-Phase Sn2 Reactions.,
J. Am. Chem. Soc., 1996, 118, 39, 9360, https://doi.org/10.1021/ja960565o
. [all data]
Sharma, Meza de Hojer, et al., 1985
Sharma, D.M.S.; Meza de Hojer, S.; Kebarle, P.,
Stabilities of halonium ions from a study of gas-phase equilibria R+ + XR' = (RXR')+,
J. Am. Chem. Soc., 1985, 107, 13, 3757, https://doi.org/10.1021/ja00299a002
. [all data]
Cox and Pilcher, 1970, 2
Cox, J.D.; Pilcher, G.,
Thermochemistry of Organic and Organometallic Compounds
in Academic Press, New York, 1970. [all data]
Rosenstock, Buff, et al., 1982
Rosenstock, H.M.; Buff, R.; Ferreira, M.A.A.; Lias, S.G.; Parr, A.C.; Stockbauer, R.L.; Holmes, J.L.,
Fragmentation mechanism and energetics of some alkyl halide ions,
J. Am. Chem. Soc., 1982, 104, 2337. [all data]
Sen Sharma and Kebarle, 1978
Sen Sharma, D.K.; Kebarle, P.,
Binding Energies and Stabilities of Chloronium Ions from Study of the Gas - Phase Equilibria: R1+ + ClR2 = R1ClR2+,
J. Am. Chem. Soc., 1978, 100, 18, 5826, https://doi.org/10.1021/ja00486a039
. [all data]
Staley and Beauchamp, 1975
Staley, R.H.; Beauchamp, J.L.,
Intrinsic Acid - Base Properties of Molecules. Binding Energies of Li+ to pi - and n - Donor Bases,
J. Am. Chem. Soc., 1975, 97, 20, 5920, https://doi.org/10.1021/ja00853a050
. [all data]
Dzidic and Kebarle, 1970
Dzidic, I.; Kebarle, P.,
Hydration of the Alkali Ions in the Gas Phase. Enthalpies and Entropies of Reactions M+(H2O)n-1 + H2O = M+(H2O)n,
J. Phys. Chem., 1970, 74, 7, 1466, https://doi.org/10.1021/j100702a013
. [all data]
Kabo and Andreevskii, 1965
Kabo, G. Ya; Andreevskii, D.N.,
Thermodynamics of monochloropropane isomerization,
Neftekhimiya, 1965, 5, 132-135. [all data]
Andreevskii, 1972
Andreevskii, D.N.,
Thermochemistry of organic halogeno-compounds,
Russ. J. Phys. Chem. (Engl. Transl.), 1972, 46, 819-820. [all data]
Davies, Lacher, et al., 1965
Davies, J.; Lacher, J.R.; Park, J.D.,
Reaction heats of organic compounds. Part 4.-Heats of hydrogenation of n- and iso-Propyl bromides and chlorides,
Trans. Faraday Soc., 1965, 61, 2413-2416. [all data]
Luo and Pacey, 1992
Luo, Y.-R.; Pacey, P.D.,
Effects of alkyl substitution on ionization energies of alkanes and haloalkanes and on heats of formation of their molecular cations. Part 2. Alkanes and chloro-, bromo- and iodoalkanes,
Int. J. Mass Spectrom. Ion Processes, 1992, 112, 63. [all data]
Kimura, Katsumata, et al., 1981
Kimura, K.; Katsumata, S.; Achiba, Y.; Yamazaki, T.; Iwata, S.,
Ionization energies, Ab initio assignments, and valence electronic structure for 200 molecules
in Handbook of HeI Photoelectron Spectra of Fundamental Organic Compounds, Japan Scientific Soc. Press, Tokyo, 1981. [all data]
Traeger, 1980
Traeger, J.C.,
Photoionization mass spectrometry of the propyl halides,
Int. J. Mass Spectrom. Ion Phys., 1980, 32, 309. [all data]
Gross, 1972
Gross, M.L.,
Ion cyclotron resonance spectrometry. A means of evaluating 'kinetic shifts',
Org. Mass Spectrom., 1972, 6, 827. [all data]
Baldwin, Maccoll, et al., 1964
Baldwin, M.; Maccoll, A.; Miller, S.I.,
Appearance potentials of the lower chloroalkanes,
J. Am. Chem. Soc., 1964, 86, 4498. [all data]
Watanabe, Nakayama, et al., 1962
Watanabe, K.; Nakayama, T.; Mottl, J.,
Ionization potentials of some molecules,
J. Quant. Spectry. Radiative Transfer, 1962, 2, 369. [all data]
Olmsted, Street, et al., 1964
Olmsted, J., III; Street, K., Jr.; Newton, A.S.,
Excess-kinetic-energy ions in organic mass spectra,
J. Chem. Phys., 1964, 40, 2114. [all data]
Maccoll and Mathur, 1980
Maccoll, A.; Mathur, D.,
Hydrogen chloride elimination from the molecular ions of alkyl chlorides,
Org. Mass Spectrom., 1980, 15, 483. [all data]
Baldwin, Maccoll, et al., 1966
Baldwin, M.; Maccoll, A.; Miller, S.I.,
Ionization and appearance potentials from a study of alkyl chlorides,
Advan. Mass Spectrom., 1966, 3, 259. [all data]
Pacáková, Vojtechová, et al., 1988
Pacáková, V.; Vojtechová, H.; Coufal, P.,
Reaction gas chromatography: study of the photodecomposition of halogenated hydrocarbons,
Chromatographia, 1988, 25, 7, 621-626, https://doi.org/10.1007/BF02327659
. [all data]
Hively and Hinton, 1968
Hively, R.A.; Hinton, R.E.,
Variation of the retention index with temperature on squalane substrates,
J. Gas Chromatogr., 1968, 6, 4, 203-217, https://doi.org/10.1093/chromsci/6.4.203
. [all data]
von Kováts, 1958
von Kováts, E.,
206. Gas-chromatographische Charakterisierung organischer Verbindungen. Teil 1: Retentionsindices aliphatischer Halogenide, Alkohole, Aldehyde und Ketone,
Helv. Chim. Acta, 1958, 41, 7, 1915-1932, https://doi.org/10.1002/hlca.19580410703
. [all data]
White, Douglas, et al., 1992
White, C.M.; Douglas, L.J.; Hackett, J.P.; Anderson, R.R.,
Characterization of synthetic gasoline from the chloromethane-zeolite reaction,
Energy Fuels, 1992, 6, 1, 76-82, https://doi.org/10.1021/ef00031a012
. [all data]
White, Hackett, et al., 1992
White, C.M.; Hackett, J.; Anderson, R.R.; Kail, S.; Spock, P.S.,
Linear temperature programmed retention indices of gasoline range hydrocarbons and chlorinated hydrocarbons on cross-linked polydimethylsiloxane,
J. Hi. Res. Chromatogr., 1992, 15, 2, 105-120, https://doi.org/10.1002/jhrc.1240150211
. [all data]
Arruda, Junkes, et al., 2008
Arruda, A.C.S.; Junkes, B. da.S.; Souza, E.S.; Yunes, R.A.; Heizen, V.E.F.,
Semi-Emlirical Topological Index to Predict Properties of Halogenated Aliphatic Compounds,
J. Chemometrics, 2008, 22, 3-4, 186-194, https://doi.org/10.1002/cem.1121
. [all data]
Huang, Liang, et al., 1996
Huang, C.; Liang, H.; Han, S.,
The analysis of organic compounds in waste water by gas extraction/thermal desorption/gas chromatography-mass spectrometry,
Chin. J. Chromatogr., 1996, 14, 6, 421-424. [all data]
Zenkevich, 2003
Zenkevich, I.G.,
Criteria for Evaluation of Elution Order of Isomeric Organic Compounds,
Zh. Phys. Khim. (Rus.), 2003, 77, 1, 92-98. [all data]
Zenkevich, 2001
Zenkevich, I.G.,
Interpretation of Gas Chromatographic Retention Indices in estimation of Structures of Isomeric Products of Radical Chlorinating of Alkyl Arenes,
Zh. Org. Khim., 2001, 37, 2, 283-293. [all data]
Zenkevich, 1999
Zenkevich, I.G.,
Mutual Correlation between Gas-Chromatographic Retention Indices of Organic Compounds from Different Series,
Zh. Anal. Khim., 1999, 54, 12, 1272-1279. [all data]
Zenkevich, 1998
Zenkevich, I.G.,
Reciprocally Unambiguous Conformity Between GC Retention Indices and Boiling Points within Two- and Multidimensional Taxonomic Groups of Organic Compounds,
J. Hi. Res. Chromatogr., 1998, 21, 10, 565-568, https://doi.org/10.1002/(SICI)1521-4168(19981001)21:10<565::AID-JHRC565>3.0.CO;2-6
. [all data]
Zenkevich and Chupalov, 1996
Zenkevich, I.G.; Chupalov, A.A.,
New Possibilities of Chromato Mass Pectrometric Identification of Organic Compounds Using Increments of Gas Chromatographic Retention Indices of Molecular Structural Fragments,
Zh. Org. Khim. (Rus.), 1996, 32, 5, 656-666. [all data]
Waggott and Davies, 1984
Waggott, A.; Davies, I.W.,
Identification of organic pollutants using linear temperature programmed retention indices (LTPRIs) - Part II, 1984, retrieved from http://dwi.defra.gov.uk/research/completed-research/reports/dwi0383.pdf. [all data]