Propanenitrile, 3,3',3''-nitrilotris-
- Formula: C9H12N4
- Molecular weight: 176.2184
- IUPAC Standard InChIKey: FYYPYNRGACGNNN-UHFFFAOYSA-N
- CAS Registry Number: 7528-78-1
- Chemical structure:
View 3d structure (requires JavaScript / HTML 5) - Other names: Propionitrile, 3,3',3''-nitrilotri-; 3,3',3''-Nitrilotripropionitrile; Amine, tris(2-cyanoethyl)-

Gas phase ion energetics data

Data compiled by: Sharon G. Lias, John E. Bartmess, Joel F. Liebman, John L. Holmes, Rhoda D. Levin, and W. Gary Mallard
Ionization energy determinations
IE (eV) | Method | Reference |
---|---|---|
10.40 | PE | Molder, Pikver, et al., 1983 |

References

Molder, Pikver, et al., 1983
Molder, U.H.; Pikver, R.J.; Koppel, I.A.,
Photoelectron spectra of molecules. 4. Amines,
Org. React. Tartu, 1983, 20, 355. [all data]