Methane, bromodichloro-
- Formula: CHBrCl2
- Molecular weight: 163.829
- IUPAC Standard InChIKey: FMWLUWPQPKEARP-UHFFFAOYSA-N
- CAS Registry Number: 75-27-4
- Chemical structure:
View 3d structure (requires JavaScript / HTML 5) - Other names: Bromodichloromethane; Dichlorobromomethane; CHBrCl2; NCI-C55243; BDCM; Dichloromonobromomethane; Monobromodichloromethane; NSC 8018

Phase change data

Data compiled as indicated in comments:
BS - Robert L. Brown and Stephen E. Stein
TRC - Thermodynamics Research Center, NIST Boulder Laboratories, Chris Muzny director
Quantity | Value | Units | Method | Reference | Comment |
---|---|---|---|---|---|
Tboil | 363. ± 1. | K | AVG | N/A | Average of 7 values; Individual data points |
Quantity | Value | Units | Method | Reference | Comment |
Tfus | 216.0 | K | N/A | Buckingham and Donaghy, 1982 | BS |
Tfus | 217.2 | K | N/A | Timmermans, 1911 | Uncertainty assigned by TRC = 0.4 K; TRC |

Gas phase ion energetics data

Data compiled as indicated in comments:
LLK - Sharon G. Lias, Rhoda D. Levin, and Sherif A. Kafafi
RDSH - Henry M. Rosenstock, Keith Draxl, Bruce W. Steiner, and John T. Herron
Ionization energy determinations
IE (eV) | Method | Reference | Comment |
---|---|---|---|
10.6 | PE | Novak, Cvitas, et al., 1981 | LLK |
10.88 ± 0.05 | EI | Harrison and Shannon, 1962 | RDSH |
10.96 | PE | Novak, Cvitas, et al., 1981 | Vertical value; LLK |
Appearance energy determinations
Ion | AE (eV) | Other Products | Method | Reference | Comment |
---|---|---|---|---|---|
CHCl2+ | 11.0 ± 0.1 | Br | EI | Harrison and Shannon, 1962 | RDSH |

Henry's Law data

Data compiled by: Rolf Sander
Henry's Law constant (water solution)
kH(T) = k°H exp(d(ln(kH))/d(1/T) ((1/T) - 1/(298.15 K)))
k°H = Henry's law constant for solubility in water at 298.15 K (mol/(kg*bar))
d(ln(kH))/d(1/T) = Temperature dependence constant (K)
k°H (mol/(kg*bar)) | d(ln(kH))/d(1/T) (K) | Method | Reference |
---|---|---|---|
0.40 | 5200. | L | N/A |
0.40 | 4700. | M | N/A |
0.51 | 3900. | X | N/A |
0.63 | M | Nicholson, Maguire, et al., 1984 | |
0.43 | C | Nicholson, Maguire, et al., 1984 | |
0.48 | C | Nicholson, Maguire, et al., 1984 | |
0.46 | 1200. | X | N/A |
0.35 | 5200. | X | N/A |

Normal alkane RI, polar column, custom temperature program

Data compiled by: NIST Mass Spectrometry Data Center, William E. Wallace, director

Column type CapillaryCapillaryCapillary
Active phase Superox 0.6; Carbowax 20MCarbowax 400, Carbowax 20M, Carbowax 1540, Carbowax 4000, Superox 06, PEG 20M, etc.Carbowax 20M
Column length (m) 50.50.
Carrier gas HydrogenHydrogen
Substrate
Column diameter (mm) 0.320.32
Phase thickness (μm)
Program not specifiednot specifiednot specified
I 1132.1132.1165.
ReferenceWaggott and Davies, 1984Waggott and Davies, 1984Ramsey and Flanagan, 1982
Comment MSDC-RI MSDC-RI MSDC-RI

References

Buckingham and Donaghy, 1982
Buckingham, J.; Donaghy, S.M.,
Dictionary of Organic Compounds: Fifth Edition, Chapman and Hall, New York, 1982, 1. [all data]
Timmermans, 1911
Timmermans, J.,
Researches on the freezing point of organic liquid compounds,
Bull. Soc. Chim. Belg., 1911, 25, 300. [all data]
Novak, Cvitas, et al., 1981
Novak, I.; Cvitas, T.; Klasinc, L.; Gusten, H.,
Photoelectron spectra of some halogenomethanes,
J. Chem. Soc. Faraday Trans. 2, 1981, 77, 2049. [all data]
Harrison and Shannon, 1962
Harrison, A.G.; Shannon, T.W.,
An electron impact study of chloromethyl and dichloromethyl derivatives,
Can. J. Chem., 1962, 40, 1730. [all data]