Silane,(1,2,3,4,5,6,7,8-octahydro-1,4,5,8-naphthalenetetrayl)tetrakis[trimethyl-

Gas phase ion energetics data

Data compiled by: Sharon G. Lias, Rhoda D. Levin, and Sherif A. Kafafi

Ionization energy determinations

IE (eV) Method Reference Comment
6.98PEBock and Kaim, 1980Vertical value

References

Bock and Kaim, 1980
Bock, H.; Kaim, W., Radical ions. 37. Ionization and one-electron oxidation of electron-rich silylalkyl olefins, J. Am. Chem. Soc., 1980, 102, 4429. [all data]