Ethylene oxide
- Formula: C2H4O
- Molecular weight: 44.0526
- IUPAC Standard InChIKey: IAYPIBMASNFSPL-UHFFFAOYSA-N
- CAS Registry Number: 75-21-8
- Chemical structure:
View 3d structure (requires JavaScript / HTML 5) - Other names: Oxirane; Dihydrooxirene; Dimethylene oxide; Epoxyethane; Ethene oxide; ETO; Oxacyclopropane; Oxane; Oxidoethane; Oxirene, dihydro-; Oxyfume; Oxyfume 12; T-Gas; 1,2-Epoxyethane; Aethylenoxid; Amprolene; Anprolene; Anproline; ENT-26263; E.O.; 1,2-Epoxyaethan; Ethyleenoxide; Etylenu tlenek; FEMA No. 2433; Merpol; NCI-C50088; α,β-Oxidoethane; Oxiraan; Oxiran; Rcra waste number U115; Sterilizing gas ethylene oxide 100%; UN 1040; Qazi-ketcham

Gas phase thermochemistry data

Data compiled as indicated in comments:
ALS - Hussein Y. Afeefy, Joel F. Liebman, and Stephen E. Stein
DRB - Donald R. Burgess, Jr.
GT - Glushko Thermocenter, Russian Academy of Sciences, Moscow
Quantity | Value | Units | Method | Reference | Comment |
---|---|---|---|---|---|
ΔfH°gas | -52.64 | kJ/mol | Review | Chase, 1998 | Data last reviewed in September, 1965 |
ΔfH°gas | -52.63 ± 0.63 | kJ/mol | Cm | Pell and Pilcher, 1965 | ALS |
ΔfH°gas | -70.2 | kJ/mol | N/A | Moureu and Dode, 1937 | Value computed using ΔfHliquid° value of -95.7±1.3 kj/mol from Moureu and Dode, 1937 and ΔvapH° value of 25.51 kj/mol from missing citation.; DRB |
Quantity | Value | Units | Method | Reference | Comment |
ΔcH°gas | -1306.0 ± 0.59 | kJ/mol | Cm | Pell and Pilcher, 1965 | Corresponding ΔfHºgas = -52.63 kJ/mol (simple calculation by NIST; no Washburn corrections); ALS |
ΔcH°gas | -1307.7 ± 0.84 | kJ/mol | Ccb | Crog and Hunt, 1942 | Corresponding ΔfHºgas = -50.96 kJ/mol (simple calculation by NIST; no Washburn corrections); ALS |
Quantity | Value | Units | Method | Reference | Comment |
S°gas,1 bar | 243.00 | J/mol*K | Review | Chase, 1998 | Data last reviewed in September, 1965 |
Constant pressure heat capacity of gas
Cp,gas (J/mol*K) | Temperature (K) | Reference | Comment |
---|---|---|---|
33.26 | 50. | Dorofeeva O.V., 1992 | p=1 bar. Selected values are in good agreement with other statistically calculated values [ Godnev I., 1948, Gunthard H., 1948, Kobe K.A., 1950, Sundaram S., 1963, Ramasamy R., 1978, Chao J., 1986].; GT |
33.28 | 100. | ||
33.82 | 150. | ||
36.19 | 200. | ||
43.71 | 273.15 | ||
47.0 ± 1.0 | 298.15 | ||
47.29 | 300. | ||
61.66 | 400. | ||
74.89 | 500. | ||
85.97 | 600. | ||
95.14 | 700. | ||
102.81 | 800. | ||
109.32 | 900. | ||
114.89 | 1000. | ||
119.67 | 1100. | ||
123.79 | 1200. | ||
127.36 | 1300. | ||
130.45 | 1400. | ||
133.14 | 1500. |
Constant pressure heat capacity of gas
Cp,gas (J/mol*K) | Temperature (K) | Reference | Comment |
---|---|---|---|
49.37 | 307.18 | Kistiakowsky G.B., 1940 | GT |
53.51 | 337.04 | ||
58.41 | 371.23 |
Gas Phase Heat Capacity (Shomate Equation)
Cp° = A + B*t + C*t2 + D*t3 +
E/t2
H° − H°298.15= A*t + B*t2/2 +
C*t3/3 + D*t4/4 − E/t + F − H
S° = A*ln(t) + B*t + C*t2/2 + D*t3/3 −
E/(2*t2) + G
Cp = heat capacity (J/mol*K)
H° = standard enthalpy (kJ/mol)
S° = standard entropy (J/mol*K)
t = temperature (K) / 1000.
View plot Requires a JavaScript / HTML 5 canvas capable browser.
Temperature (K) | 298. to 1200. | 1200. to 6000. |
---|---|---|
A | -23.25802 | 131.3483 |
B | 275.6997 | 13.80594 |
C | -188.9729 | -2.645062 |
D | 51.03350 | 0.175820 |
E | 0.386930 | -30.03639 |
F | -55.09156 | -158.3795 |
G | 142.7777 | 313.4276 |
H | -52.63514 | -52.63514 |
Reference | Chase, 1998 | Chase, 1998 |
Comment | Data last reviewed in September, 1965 | Data last reviewed in September, 1965 |

Condensed phase thermochemistry data

Data compiled as indicated in comments:
ALS - Hussein Y. Afeefy, Joel F. Liebman, and Stephen E. Stein
DH - Eugene S. Domalski and Elizabeth D. Hearing
Quantity | Value | Units | Method | Reference | Comment |
---|---|---|---|---|---|
ΔfH°liquid | -95.7 ± 1.3 | kJ/mol | Ccb | Moureu and Dode, 1937 | Reanalyzed by Cox and Pilcher, 1970, Original value = -95.4 kJ/mol; ALS |
Quantity | Value | Units | Method | Reference | Comment |
ΔcH°liquid | -1262.9 ± 1.3 | kJ/mol | Ccb | Moureu and Dode, 1937 | Reanalyzed by Cox and Pilcher, 1970, Original value = -1264. kJ/mol; Corresponding ΔfHºliquid = -95.73 kJ/mol (simple calculation by NIST; no Washburn corrections); ALS |
Quantity | Value | Units | Method | Reference | Comment |
S°liquid | 149.45 | J/mol*K | N/A | Giauque and Gordon, 1949 | DH |
Constant pressure heat capacity of liquid
Cp,liquid (J/mol*K) | Temperature (K) | Reference | Comment |
---|---|---|---|
86.90 | 285. | Giauque and Gordon, 1949 | T = 15 to 283 K.; DH |

Gas phase ion energetics data

Data evaluated as indicated in comments:
HL - Edward P. Hunter and Sharon G. Lias
L - Sharon G. Lias
Data compiled as indicated in comments:
LL - Sharon G. Lias and Joel F. Liebman
LBLHLM - Sharon G. Lias, John E. Bartmess, Joel F. Liebman, John L. Holmes, Rhoda D. Levin, and W. Gary Mallard
LLK - Sharon G. Lias, Rhoda D. Levin, and Sherif A. Kafafi
RDSH - Henry M. Rosenstock, Keith Draxl, Bruce W. Steiner, and John T. Herron
Quantity | Value | Units | Method | Reference | Comment |
---|---|---|---|---|---|
IE (evaluated) | 10.56 ± 0.01 | eV | N/A | N/A | L |
Quantity | Value | Units | Method | Reference | Comment |
Proton affinity (review) | 774.2 | kJ/mol | N/A | Hunter and Lias, 1998 | HL |
Quantity | Value | Units | Method | Reference | Comment |
Gas basicity | 745.3 | kJ/mol | N/A | Hunter and Lias, 1998 | HL |
Ionization energy determinations
IE (eV) | Method | Reference | Comment |
---|---|---|---|
10.15 ± 0.05 | EI | Holmes and Lossing, 1991 | LL |
10.4 ± 0.1 | PE | Aue, Webb, et al., 1980 | LLK |
10.4 | PE | Aue and Bowers, 1979 | LLK |
10.57 | EI | Holmes, Terlouw, et al., 1976 | LLK |
10.6 ± 0.1 | PI | Corderman, LeBreton, et al., 1976 | LLK |
10.560 | PE | Corderman, LeBreton, et al., 1976 | LLK |
10.56 ± 0.01 | PI | Krassig, Reinke, et al., 1974 | LLK |
10.57 | PE | Basch, Robin, et al., 1969 | RDSH |
10.566 | S | Lowrey and Watanabe, 1958 | RDSH |
10.57 ± 0.01 | PI | Watanabe, 1957 | RDSH |
10.57 | EI | Vorob'ev, Furlei, et al., 1989 | Vertical value; LL |
10.57 | PIPECO | Johnson, Powis, et al., 1982 | Vertical value; LBLHLM |
10.57 | PE | Bieri, Asbrink, et al., 1982 | Vertical value; LBLHLM |
10.57 | PE | Kimura, Katsumata, et al., 1981 | Vertical value; LLK |
10.568 | PE | Aue, Webb, et al., 1975 | Vertical value; LLK |
Appearance energy determinations

Vibrational and/or electronic energy levels

Data compiled by: Takehiko Shimanouchi
Symmetry: C2ν Symmetry Number σ = 2
Sym. | No | Approximate | Selected Freq. | Infrared | Raman | Comments | ||||
---|---|---|---|---|---|---|---|---|---|---|
Species | type of mode | Value | Rating | Value | Phase | Value | Phase | |||
a1 | 1 | CH2 s-str | 3006 | C | 3006 S | gas | 3005 S p | liq. | ||
a1 | 2 | CH2 scis | 1498 | B | 1498 W | gas | 1490 W p | liq. | ||
a1 | 3 | Ring str | 1271 | B | 1271 S | gas | 1266 S p | liq. | ||
a1 | 4 | CH2 wag | 1120 | D | 1118 W | solid solid | 1120 M p | liq. | ||
a1 | 5 | Ring deform | 877 | B | 877 VS | gas | 867 M dp | liq. | ||
a2 | 6 | CH2 a-str | 3063 | D | ia | 3063 W dp | liq. | OV(ν13) | ||
a2 | 7 | CH2 twist | 1300 | E | ia | |||||
a2 | 8 | CH2 rock | 860 | E | ia | |||||
b1 | 9 | CH2 s-str | 3006 | C | 3006 S | gas | 3005 S p | liq. | OV(ν1) | |
b1 | 10 | CH2 scis | 1472 | B | 1472 W | gas | ||||
b1 | 11 | CH2 wag | 1151 | D | 1151 M | gas | 1150 W dp | liq. | ||
b1 | 12 | Ring deform | 892 | D | 892 VS | gas | ||||
b2 | 13 | CH2 a-str | 3065 | B | 3065 S | gas | 3063 W dp | liq. | ||
b2 | 14 | CH2 twist | 1142 | D | 1142 M | gas | 1150 W dp | liq. | ||
b2 | 15 | CH2 rock | 822 | B | 822 M | gas | 807 M dp | liq. | ||
Source: Shimanouchi, 1972

Kovats' RI, non-polar column, isothermal

Column type | Active phase | Temperature (C) | I | Reference | Comment |
---|---|---|---|---|---|
Packed | Apiezon L | 120. | 397. | Bogoslovsky, Anvaer, et al., 1978 | Celite 545 |
Packed | Apiezon L | 160. | 410. | Bogoslovsky, Anvaer, et al., 1978 | Celite 545 |

Normal alkane RI, non-polar column, temperature ramp

Column type | Active phase | I | Reference | Comment |
---|---|---|---|---|
Capillary | OV-101 | 417. | Zenkevich, 2005 | 25. m/0.20 mm/0.10 μm, N2/He, 6. K/min; Tstart: 50. C; Tend: 250. C |

Normal alkane RI, non-polar column, custom temperature program

Column type | Active phase | I | Reference | Comment |
---|---|---|---|---|
Capillary | Methyl Silicone | 417. | Farkas, Héberger, et al., 2004 | Program: not specified |
Capillary | SPB-1 | 405. | Flanagan, Streete, et al., 1997 | 60. m/0.53 mm/5. μm, He; Program: 40C(6min) => 5C/min => 80C => 10C/min => 200C |
Capillary | SPB-1 | 405. | Strete, Ruprah, et al., 1992 | 60. m/0.53 mm/5.0 μm, Helium; Program: 40 0C (6 min) 5 0C/min -> 80 0C 10 0C/min -> 200 0C |
Capillary | SPB-1 | 400. | Strete, Ruprah, et al., 1992 | 60. m/0.53 mm/5.0 μm, Helium; Program: not specified |
Capillary | OV-1 | 400. | Ramsey and Flanagan, 1982 | Program: not specified |

Normal alkane RI, polar column, custom temperature program

Column type | Active phase | I | Reference | Comment |
---|---|---|---|---|
Capillary | Carbowax 20M | 680. | Ramsey and Flanagan, 1982 | Program: not specified |

Reaction thermochemistry data

Data compiled by: Hussein Y. Afeefy, Joel F. Liebman, and Stephen E. Stein
Individual Reactions
By formula: C16H35NO2 = C12H27N + 2C2H4O
Quantity | Value | Units | Method | Reference | Comment |
---|---|---|---|---|---|
ΔrH° | -1004. ± 27. | kJ/mol | Eqk | Balcerowiak, Jerzykiewicz, et al., 1984 | solid phase |
By formula: C14H31NO = C12H27N + C2H4O
Quantity | Value | Units | Method | Reference | Comment |
---|---|---|---|---|---|
ΔrH° | -120.0 ± 4.6 | kJ/mol | Eqk | Balcerowiak, Jerzykiewicz, et al., 1984 | liquid phase |

Phase change data

Data compiled as indicated in comments:
TRC - Thermodynamics Research Center, NIST Boulder Laboratories, Chris Muzny director
AC - William E. Acree, Jr., James S. Chickos
DH - Eugene S. Domalski and Elizabeth D. Hearing
ALS - Hussein Y. Afeefy, Joel F. Liebman, and Stephen E. Stein
Quantity | Value | Units | Method | Reference | Comment |
---|---|---|---|---|---|
Tboil | 283.7 | K | N/A | Majer and Svoboda, 1985 | |
Tboil | 286.15 | K | N/A | Moureu and Dode, 1937, 2 | Uncertainty assigned by TRC = 1.5 K; TRC |
Tboil | 283.85 | K | N/A | Timmermans and Hennaut-Roland, 1937 | Uncertainty assigned by TRC = 0.4 K; TRC |
Tboil | 283.88 | K | N/A | Maass and Boomer, 1922 | Uncertainty assigned by TRC = 0.2 K; TRC |
Tboil | 286. | K | N/A | Von Auwers and Eisenlohr, 1910 | Uncertainty assigned by TRC = 4. K; TRC |
Quantity | Value | Units | Method | Reference | Comment |
Tfus | 160.6 | K | N/A | McDonald, Shrader, et al., 1959 | Uncertainty assigned by TRC = 0.07 K; TRC |
Tfus | 161.45 | K | N/A | Timmermans and Hennaut-Roland, 1937 | Uncertainty assigned by TRC = 0.4 K; TRC |
Tfus | 161.9 | K | N/A | Maass and Boomer, 1922 | Uncertainty assigned by TRC = 0.6 K; TRC |
Quantity | Value | Units | Method | Reference | Comment |
Ttriple | 160.65 | K | N/A | Wilhoit, Chao, et al., 1985 | Uncertainty assigned by TRC = 0.05 K; TRC |
Ttriple | 160.65 | K | N/A | Giauque and Gordon, 1949, 2 | Uncertainty assigned by TRC = 0.02 K; TRC |
Quantity | Value | Units | Method | Reference | Comment |
Tc | 468.9 | K | N/A | Walters and Smith, 1952 | Uncertainty assigned by TRC = 1.11 K; TRC |
Tc | 469.0 | K | N/A | Hess and Tilton, 1950 | Uncertainty assigned by TRC = 1. K; TRC |
Tc | 465.2 | K | N/A | Maass and Boomer, 1922 | Uncertainty assigned by TRC = 2. K; TRC |
Quantity | Value | Units | Method | Reference | Comment |
Pc | 71.38 | atm | N/A | Walters and Smith, 1952 | Uncertainty assigned by TRC = 0.6804 atm; TRC |
Pc | 70.97 | atm | N/A | Hess and Tilton, 1950 | Uncertainty assigned by TRC = 0.7485 atm; TRC |
Quantity | Value | Units | Method | Reference | Comment |
ρc | 7.13 | mol/l | N/A | Walters and Smith, 1952 | Uncertainty assigned by TRC = 0.23 mol/l; TRC |
ρc | 7.26 | mol/l | N/A | Post, 1950 | Uncertainty assigned by TRC = 0.23 mol/l; TRC |
Quantity | Value | Units | Method | Reference | Comment |
ΔvapH° | 6.097 | kcal/mol | N/A | Majer and Svoboda, 1985 | |
ΔvapH° | 6.19 | kcal/mol | A | Stephenson and Malanowski, 1987 | Based on data from 283. to 385. K.; AC |
Enthalpy of vaporization
ΔvapH (kcal/mol) | Temperature (K) | Method | Reference | Comment |
---|---|---|---|---|
6.1011 | 283.66 | N/A | Giauque and Gordon, 1949 | P = 101.325 kPa; DH |
6.104 | 283.7 | N/A | Majer and Svoboda, 1985 | |
6.41 | 269. | A | Stephenson and Malanowski, 1987 | Based on data from 239. to 284. K. See also McDonald, Shrader, et al., 1959, 2 and Dykyj, 1970.; AC |
6.41 | 269. | A | Stephenson and Malanowski, 1987 | Based on data from 223. to 284. K. See also Giauque and Gordon, 1949.; AC |
6.10 ± 0.06 | 283.66 | V | Giauque and Gordon, 1949, 3 | ALS |
6.43 | 290. | N/A | Moor, Kanep, et al., 1937 | Based on data from 268. to 313. K.; AC |
Entropy of vaporization
ΔvapS (cal/mol*K) | Temperature (K) | Reference | Comment |
---|---|---|---|
21.51 | 283.66 | Giauque and Gordon, 1949 | P; DH |
Antoine Equation Parameters
log10(P) = A − (B / (T + C))
P = vapor pressure (atm)
T = temperature (K)
View plot Requires a JavaScript / HTML 5 canvas capable browser.
Temperature (K) | A | B | C | Reference | Comment |
---|---|---|---|---|---|
182.59 to 283.59 | 4.380 | 1115.1 | -29.015 | McDonald, Shrader, et al., 1959, 2 | |
273.4 to 304.9 | 5.84125 | 2022.83 | 62.656 | Coles and Popper, 1950 | Coefficents calculated by NIST from author's data. |
Enthalpy of fusion
ΔfusH (kcal/mol) | Temperature (K) | Reference | Comment |
---|---|---|---|
1.2364 | 160.65 | Giauque and Gordon, 1949 | DH |
1.24 | 160.7 | Domalski and Hearing, 1996 | AC |
Entropy of fusion
ΔfusS (cal/mol*K) | Temperature (K) | Reference | Comment |
---|---|---|---|
7.696 | 160.65 | Giauque and Gordon, 1949 | DH |

References

Chase, 1998
Chase, M.W., Jr.,
NIST-JANAF Themochemical Tables, Fourth Edition,
J. Phys. Chem. Ref. Data, Monograph 9, 1998, 1-1951. [all data]
Pell and Pilcher, 1965
Pell, A.S.; Pilcher, G.,
Measurements of heats of combustion by flame calorimetry. Part 3.-Ethylene oxide, trimethylene oxide, tetrahydrofuran and tetrahydropy,
Trans. Faraday Soc., 1965, 61, 71-77. [all data]
Moureu and Dode, 1937
Moureu, H.; Dode, M.,
Chaleurs de formation de l'oxyde d'ethylene, de l'ethanediol et de quelques homologues,
Bull. Soc. Chim. France, 1937, 4, 637-647. [all data]
Crog and Hunt, 1942
Crog, R.S.; Hunt, H.,
Heats of combustion. II. The heats of combustion of ethyl methyl ketone and ethylene oxide,
J. Phys. Chem., 1942, 46, 1162-1163. [all data]
Dorofeeva O.V., 1992
Dorofeeva O.V.,
Ideal gas thermodynamic properties of oxygen heterocyclic compounds. Part 1. Three-membered, four-membered and five-membered rings,
Thermochim. Acta, 1992, 194, 9-46. [all data]
Godnev I., 1948
Godnev I.,
Thermodynamic functions of ethylene oxide,
Zh. Fiz. Khim., 1948, 22, 801-803. [all data]
Gunthard H., 1948
Gunthard H.,
Thermodynamic properties of ethylene oxide,
Helv. Chim. Acta, 1948, 31, 2128-2132. [all data]
Kobe K.A., 1950
Kobe K.A.,
Thermochemistry for the petrochemical industry. XIII. Some oxygenated hydrocarbons C1 and C2,
Petrol. Refiner, 1950, 29 (9), 135-138. [all data]
Sundaram S., 1963
Sundaram S.,
Thermodynamic functions of some propellants,
Z. Phys. Chem. (Frankfurt), 1963, 36, 376-377. [all data]
Ramasamy R., 1978
Ramasamy R.,
Centrifugal distortion constants and thermodynamic functions of ethylene oxide, ethylene oxide-d4, and ethylene sulfide,
Curr. Sci., 1978, 47, 668-669. [all data]
Chao J., 1986
Chao J.,
Thermodynamic properties of key organic oxygen compounds in the carbon range C1 to C4. Part 2. Ideal gas properties,
J. Phys. Chem. Ref. Data, 1986, 15, 1369-1436. [all data]
Kistiakowsky G.B., 1940
Kistiakowsky G.B.,
Gaseous heat capacities. III,
J. Chem. Phys., 1940, 8, 618-622. [all data]
Cox and Pilcher, 1970
Cox, J.D.; Pilcher, G.,
Thermochemistry of Organic and Organometallic Compounds, Academic Press, New York, 1970, 1-636. [all data]
Giauque and Gordon, 1949
Giauque, W.F.; Gordon, J.,
The entropy of ethylene oxide. Heat capacity from 14 to 285K. Vapor pressure. Heats of fusion and vaporization,
J. Am. Chem. Soc., 1949, 71, 2176-2181. [all data]
Hunter and Lias, 1998
Hunter, E.P.; Lias, S.G.,
Evaluated Gas Phase Basicities and Proton Affinities of Molecules: An Update,
J. Phys. Chem. Ref. Data, 1998, 27, 3, 413-656, https://doi.org/10.1063/1.556018
. [all data]
Holmes and Lossing, 1991
Holmes, J.L.; Lossing, F.P.,
Ionization energies of homologous organic compounds and correlation with molecular size,
Org. Mass Spectrom., 1991, 26, 537. [all data]
Aue, Webb, et al., 1980
Aue, D.H.; Webb, H.M.; Davidson, W.R.; Vidal, M.; Bowers, M.T.; Goldwhite, H.; Vertal, L.E.; Douglas, J.E.; Kollman, P.A.; Kenyon, G.L.,
Proton affinities photoelectron spectra of three-membered-ring J. Heterocycl. Chem.,
J. Am. Chem. Soc., 1980, 102, 5151. [all data]
Aue and Bowers, 1979
Aue, D.H.; Bowers, M.T.,
Chapter 9. Stabilities of positive ions from equilibrium gas phase basicity measurements
in Ions Chemistry,, ed. M.T. Bowers, 1979. [all data]
Holmes, Terlouw, et al., 1976
Holmes, J.L.; Terlouw, J.K.; Lossing, F.P.,
The thermochemistry of C2H4O+ ions,
J. Phys. Chem., 1976, 80, 2860. [all data]
Corderman, LeBreton, et al., 1976
Corderman, R.R.; LeBreton, P.R.; Buttrill, S.E., Jr.; Williamson, A.D.; Beauchamp, J.L.,
Photoionization and ion cyclotron resonance studies of the ion chemistry of ethylene oxide,
J. Chem. Phys., 1976, 65, 4929. [all data]
Krassig, Reinke, et al., 1974
Krassig, R.; Reinke, D.; Baumgartel, H.,
Photo-reaktionen kleiner organischer molekule II. Die photoionenspektren der Isomeren propylen-cyclopropan und acetaldehyd-athylenoxyd,
Ber. Bunsen-Ges. Phys. Chem., 1974, 78, 425. [all data]
Basch, Robin, et al., 1969
Basch, H.; Robin, M.B.; Kuebler, N.A.; Baker, C.; Turner, D.W.,
Optical and photoelectron spectra of small rings. III. The saturated three-membered rings,
J. Chem. Phys., 1969, 51, 52. [all data]
Lowrey and Watanabe, 1958
Lowrey, A., III; Watanabe, K.,
Absorption and ionization coefficients of ethylene oxide,
J. Chem. Phys., 1958, 28, 208. [all data]
Watanabe, 1957
Watanabe, K.,
Ionization potentials of some molecules,
J. Chem. Phys., 1957, 26, 542. [all data]
Vorob'ev, Furlei, et al., 1989
Vorob'ev, A.S.; Furlei, I.I.; Sultanov, A.S.; Khvostenko, V.I.; Leplyanin, G.V.; Derzhinskii, A.R.; Tolstikov, G.A.,
Mass spectrometry of reasonance capture of electrons and photoelectron spectroscopy of molecules of ethylene oxide, ethylene sulfide, and their derivatives,
Bull. Acad. Sci. USSR, Div. Chem. Sci., 1989, 1388. [all data]
Johnson, Powis, et al., 1982
Johnson, K.; Powis, I.; Danby, C.J.,
A photoelectron-photoion coincidence study of acetaldehyde and ethylene oxide molecular ions,
Chem. Phys., 1982, 70, 329. [all data]
Bieri, Asbrink, et al., 1982
Bieri, G.; Asbrink, L.; Von Niessen, W.,
30.4-nm He(II) photoelectron spectra of organic molecules,
J. Electron Spectrosc. Relat. Phenom., 1982, 27, 129. [all data]
Kimura, Katsumata, et al., 1981
Kimura, K.; Katsumata, S.; Achiba, Y.; Yamazaki, T.; Iwata, S.,
Ionization energies, Ab initio assignments, and valence electronic structure for 200 molecules
in Handbook of HeI Photoelectron Spectra of Fundamental Organic Compounds, Japan Scientific Soc. Press, Tokyo, 1981. [all data]
Aue, Webb, et al., 1975
Aue, D.H.; Webb, H.M.; Bowers, M.T.,
Proton affinities, ionization potentials, and hydrogen affinities of nitrogen and oxygen bases. Hybridization effects,
J. Am. Chem. Soc., 1975, 97, 4137. [all data]
Gallegos and Kiser, 1961
Gallegos, E.J.; Kiser, R.W.,
Electron impact spectroscopy of ethylene oxide and propylene oxide,
J. Am. Chem. Soc., 1961, 83, 773. [all data]
Burgers and Holmes, 1982
Burgers, P.C.; Holmes, J.L.,
Metastable ion studies. XIII. The measurement of appearance energies of metastable peaks,
Org. Mass Spectrom., 1982, 17, 123. [all data]