1-Azabicyclo[4.4.4]tetradecane

Gas phase ion energetics data

Data evaluated as indicated in comments:
HL - Edward P. Hunter and Sharon G. Lias

Data compiled as indicated in comments:
LBLHLM - Sharon G. Lias, John E. Bartmess, Joel F. Liebman, John L. Holmes, Rhoda D. Levin, and W. Gary Mallard

Quantity Value Units Method Reference Comment
Proton affinity (review)897.0kJ/molN/AHunter and Lias, 1998HL
Quantity Value Units Method Reference Comment
Gas basicity864.5kJ/molN/AHunter and Lias, 1998HL

Ionization energy determinations

IE (eV) Method Reference Comment
7.3PEAlder, Arrowsmith, et al., 1982LBLHLM
7.8PEAlder, Arrowsmith, et al., 1982Vertical value; LBLHLM

References

Hunter and Lias, 1998
Hunter, E.P.; Lias, S.G., Evaluated Gas Phase Basicities and Proton Affinities of Molecules: An Update, J. Phys. Chem. Ref. Data, 1998, 27, 3, 413-656, https://doi.org/10.1063/1.556018 . [all data]

Alder, Arrowsmith, et al., 1982
Alder, R.W.; Arrowsmith, R.J.; Boothby, C.S.J.; Heilbronner, E.; Zhong-zhi, Y., 1-Azabicyclo[4.4.4]tetradec-5-ene, J. Chem. Soc., Chem. Commun., 1982, 940. [all data]