Cyclopropane
- Formula: C3H6
- Molecular weight: 42.0797
- IUPAC Standard InChIKey: LVZWSLJZHVFIQJ-UHFFFAOYSA-N
- CAS Registry Number: 75-19-4
- Chemical structure:
View 3d structure (requires JavaScript / HTML 5) - Other names: Trimethylene; Trimethylene (cyclic); UN 1027; Cyclopropnane

Gas phase thermochemistry data

Data compiled as indicated in comments:
ALS - Hussein Y. Afeefy, Joel F. Liebman, and Stephen E. Stein
GT - Glushko Thermocenter, Russian Academy of Sciences, Moscow
Quantity | Value | Units | Method | Reference | Comment |
---|---|---|---|---|---|
ΔfH°gas | 39.30 | kJ/mol | Cm | Lacher, Walden, et al., 1950 | Heat of hydrobromination; ALS |
ΔfH°gas | 53.30 ± 0.59 | kJ/mol | Cm | Knowlton and Rossini, 1949 | ALS |
Quantity | Value | Units | Method | Reference | Comment |
ΔcH°gas | -2091.4 ± 0.54 | kJ/mol | Cm | Knowlton and Rossini, 1949 | Corresponding ΔfHºgas = 53.35 kJ/mol (simple calculation by NIST; no Washburn corrections); ALS |
Constant pressure heat capacity of gas
Cp,gas (J/mol*K) | Temperature (K) | Reference | Comment |
---|---|---|---|
33.26 | 50. | Dorofeeva O.V., 1986 | Selected S(T) and Cp(T) values are in good agreement with those calculated earlier [ Kobe K.A., 1950]. The agreement with the data of [80KAR/PAM] increases as the temperature increases (up to 2 J/mol*K in Cp(1000 K)).; GT |
33.32 | 100. | ||
34.56 | 150. | ||
38.91 | 200. | ||
50.69 | 273.15 | ||
55.6 ± 1.0 | 298.15 | ||
55.94 | 300. | ||
76.05 | 400. | ||
93.86 | 500. | ||
108.54 | 600. | ||
120.68 | 700. | ||
130.91 | 800. | ||
139.66 | 900. | ||
147.21 | 1000. | ||
153.75 | 1100. | ||
159.43 | 1200. | ||
164.38 | 1300. | ||
168.69 | 1400. | ||
172.45 | 1500. |
Constant pressure heat capacity of gas
Cp,gas (J/mol*K) | Temperature (K) | Reference | Comment |
---|---|---|---|
35.38 | 157.8 | Kistiakowsky G.B., 1940 | Please also see Kistiakowsky G.B., 1940, 2.; GT |
42.16 | 220.1 | ||
42.55 | 223.7 | ||
48.68 | 258.7 | ||
50.63 | 272.15 | ||
54.66 | 291.4 | ||
55.25 | 295.5 | ||
56.48 | 300.48 | ||
59.29 | 313.9 | ||
59.27 | 316.7 | ||
60.90 | 325.1 | ||
62.17 | 332.8 | ||
63.18 | 333.70 | ||
64.27 | 338.9 | ||
63.26 | 339.6 | ||
70.17 | 368.46 |

Reaction thermochemistry data

Data compiled as indicated in comments:
B - John E. Bartmess
ALS - Hussein Y. Afeefy, Joel F. Liebman, and Stephen E. Stein
Individual Reactions
C3H5- + =
Quantity | Value | Units | Method | Reference | Comment |
---|---|---|---|---|---|
ΔrH° | 1716. ± 10. | kJ/mol | AVG | N/A | Average of 5 out of 7 values; Individual data points |
Quantity | Value | Units | Method | Reference | Comment |
ΔrG° | 1676. ± 10. | kJ/mol | AVG | N/A | Average of 3 out of 6 values; Individual data points |
By formula: HBr + C3H6 = C3H7Br
Quantity | Value | Units | Method | Reference | Comment |
---|---|---|---|---|---|
ΔrH° | -107.8 ± 1.3 | kJ/mol | Cm | Lacher, Kianpour, et al., 1957 | gas phase; ALS |
ΔrH° | -94.94 ± 0.65 | kJ/mol | Cm | Lacher, Walden, et al., 1950 | gas phase; Heat of hydrobromination; ALS |
By formula: C3H6I2 = C3H6 + I2
Quantity | Value | Units | Method | Reference | Comment |
---|---|---|---|---|---|
ΔrH° | 77. ± 17. | kJ/mol | Eqk | Benson and Amano, 1962 | gas phase; ALS |

Gas phase ion energetics data

Data evaluated as indicated in comments:
HL - Edward P. Hunter and Sharon G. Lias
L - Sharon G. Lias
Data compiled as indicated in comments:
B - John E. Bartmess
LBLHLM - Sharon G. Lias, John E. Bartmess, Joel F. Liebman, John L. Holmes, Rhoda D. Levin, and W. Gary Mallard
LLK - Sharon G. Lias, Rhoda D. Levin, and Sherif A. Kafafi
RDSH - Henry M. Rosenstock, Keith Draxl, Bruce W. Steiner, and John T. Herron
Quantity | Value | Units | Method | Reference | Comment |
---|---|---|---|---|---|
IE (evaluated) | 9.86 ± 0.04 | eV | N/A | N/A | L |
Quantity | Value | Units | Method | Reference | Comment |
Proton affinity (review) | 750.3 | kJ/mol | N/A | Hunter and Lias, 1998 | HL |
Quantity | Value | Units | Method | Reference | Comment |
Gas basicity | 722.2 | kJ/mol | N/A | Hunter and Lias, 1998 | HL |
Ionization energy determinations
IE (eV) | Method | Reference | Comment |
---|---|---|---|
9.90 | PI | Traeger, 1984 | LBLHLM |
9.86 | EQ | Lias and Buckley, 1984 | LBLHLM |
10.60 | PE | Kimura, Katsumata, et al., 1981 | LLK |
9.8 ± 0.1 | PE | Bieri, Burger, et al., 1977 | LLK |
10.3 ± 0.1 | EI | Rothgery, Holt, et al., 1975 | LLK |
9.91 ± 0.03 | PI | Krassig, Reinke, et al., 1974 | LLK |
≤9.93 | EI | Lossing, 1972 | LLK |
≤9.8 | PE | Basch, Robin, et al., 1969 | RDSH |
10.1 | CI | Cermak, 1968 | RDSH |
10.06 ± 0.03 | PI | Watanabe, Nakayama, et al., 1962 | RDSH |
10.54 | PE | Plemenkov, Villem, et al., 1981 | Vertical value; LLK |
10.6 ± 0.1 | PE | Bieri, Burger, et al., 1977 | Vertical value; LLK |
Appearance energy determinations
Ion | AE (eV) | Other Products | Method | Reference | Comment |
---|---|---|---|---|---|
CH2+ | 19.3 | C2H4 | EI | Haney and Franklin, 1968 | RDSH |
C2H2+ | 12.71 ± 0.06 | CH4 | PI | Krassig, Reinke, et al., 1974 | LLK |
C2H2+ | 13.1 | CH4 | EI | Haney and Franklin, 1968 | RDSH |
C2H3+ | 12.64 ± 0.05 | CH3 | PI | Krassig, Reinke, et al., 1974 | LLK |
C2H3+ | 13.4 | CH3 | EI | Haney and Franklin, 1968 | RDSH |
C2H3+ | 13.3 ± 0.2 | CH3 | EI | Harrison and Tait, 1962 | RDSH |
C3H+ | 19.7 ± 0.5 | 2H2+H | EI | Harrison and Tait, 1962 | RDSH |
C3H3+ | 12.1 ± 0.1 | H2+H(-) | PI | Krassig, Reinke, et al., 1974 | LLK |
C3H3+ | 12.9 ± 0.1 | H2+H | PI | Krassig, Reinke, et al., 1974 | LLK |
C3H3+ | 13.7 ± 0.1 | H2+H | EI | Harrison and Tait, 1962 | RDSH |
C3H4+ | 11.64 ± 0.15 | H2 | PI | Krassig, Reinke, et al., 1974 | LLK |
C3H4+ | 11.6 ± 0.1 | H2 | EI | Harrison and Tait, 1962 | RDSH |
C3H5+ | 11.43 | H | PI | Traeger, 1984 | LBLHLM |
C3H5+ | 11.47 | H | PI | Buttrill, Williamson, et al., 1975 | LLK |
C3H5+ | 10.74 ± 0.09 | H(-) | PI | Krassig, Reinke, et al., 1974 | LLK |
C3H5+ | 11.44 ± 0.05 | H | PI | Krassig, Reinke, et al., 1974 | LLK |
C3H5+ | 11.49 | H | EI | Lossing, 1972 | LLK |
De-protonation reactions
C3H5- + =
Quantity | Value | Units | Method | Reference | Comment |
---|---|---|---|---|---|
ΔrH° | 1716. ± 10. | kJ/mol | AVG | N/A | Average of 5 out of 7 values; Individual data points |
Quantity | Value | Units | Method | Reference | Comment |
ΔrG° | 1676. ± 10. | kJ/mol | AVG | N/A | Average of 3 out of 6 values; Individual data points |

Condensed phase thermochemistry data

Data compiled by: Eugene S. Domalski and Elizabeth D. Hearing
Quantity | Value | Units | Method | Reference | Comment |
---|---|---|---|---|---|
S°liquid | 142.63 | J/mol*K | N/A | Ruehrwein and Powell, 1946 |
Constant pressure heat capacity of liquid
Cp,liquid (J/mol*K) | Temperature (K) | Reference | Comment |
---|---|---|---|
81.34 | 240. | Ruehrwein and Powell, 1946 | T = 14 to 240 K. |

Phase change data

Data compiled as indicated in comments:
BS - Robert L. Brown and Stephen E. Stein
TRC - Thermodynamics Research Center, NIST Boulder Laboratories, Chris Muzny director
AC - William E. Acree, Jr., James S. Chickos
DH - Eugene S. Domalski and Elizabeth D. Hearing
Quantity | Value | Units | Method | Reference | Comment |
---|---|---|---|---|---|
Tboil | 240. ± 3. | K | AVG | N/A | Average of 8 values; Individual data points |
Quantity | Value | Units | Method | Reference | Comment |
Tfus | 146. ± 3. | K | AVG | N/A | Average of 6 values; Individual data points |
Quantity | Value | Units | Method | Reference | Comment |
Ttriple | 145.8 | K | N/A | Tickner and Lossing, 1951 | Uncertainty assigned by TRC = 0.8 K; from change in slope of obs. vapor pressure; TRC |
Ttriple | 145.57 | K | N/A | Ruehrwein and Powell, 1946, 2 | Uncertainty assigned by TRC = 0.02 K; temp. scale for Tc = 273.10K; TRC |
Ttriple | 145.59 | K | N/A | Ruehrwein and Powell, 1946, 2 | Uncertainty assigned by TRC = 0.08 K; TRC |
Quantity | Value | Units | Method | Reference | Comment |
Tc | 398.0 ± 0.3 | K | N/A | Daubert, 1996 | |
Tc | 398.3 | K | N/A | Lin, Silberberg, et al., 1970 | Uncertainty assigned by TRC = 0.05 K; TRC |
Tc | 397.80 | K | N/A | Booth and Morris, 1958 | Uncertainty assigned by TRC = 0.15 K; mean of measurements on three samples by visual obssrvation; TRC |
Tc | 397.8 | K | N/A | Horneg, 1941 | Uncertainty assigned by TRC = 1. K; TRC |
Quantity | Value | Units | Method | Reference | Comment |
Pc | 54.7 ± 0.5 | atm | N/A | Daubert, 1996 | |
Pc | 55.0650 | atm | N/A | Lin, Silberberg, et al., 1970 | Uncertainty assigned by TRC = 0.0499 atm; TRC |
Pc | 54.23 | atm | N/A | Booth and Morris, 1958 | Uncertainty assigned by TRC = 0.2000 atm; mean of measurements on 3 samples, visual observation; TRC |
Pc | 3.231 | atm | N/A | Horneg, 1941 | Uncertainty assigned by TRC = 0.01 atm; TRC |
Quantity | Value | Units | Method | Reference | Comment |
Vc | 0.162 | l/mol | N/A | Daubert, 1996 | |
Quantity | Value | Units | Method | Reference | Comment |
ρc | 6.15 ± 0.05 | mol/l | N/A | Daubert, 1996 | |
ρc | 6.143 | mol/l | N/A | Lin, Silberberg, et al., 1970 | Uncertainty assigned by TRC = 0.007 mol/l; TRC |
Quantity | Value | Units | Method | Reference | Comment |
ΔvapH° | 4.328 | kcal/mol | N/A | Majer and Svoboda, 1985 | |
ΔvapH° | 4.068 | kcal/mol | N/A | Lin, Silberberg, et al., 1970, 2 | AC |
Enthalpy of vaporization
ΔvapH (kcal/mol) | Temperature (K) | Method | Reference | Comment |
---|---|---|---|---|
4.7930 | 240.34 | N/A | Ruehrwein and Powell, 1946 | P = 101.325 kPa; DH |
4.792 | 240.3 | N/A | Majer and Svoboda, 1985 | |
5.21 | 210. | N/A | Calado, Filipe, et al., 1997 | Based on data from 195. to 225. K.; AC |
4.88 | 373. | A | Stephenson and Malanowski, 1987 | Based on data from 358. to 398. K.; AC |
4.76 | 312. | A | Stephenson and Malanowski, 1987 | Based on data from 297. to 359. K.; AC |
4.85 | 224. | A | Stephenson and Malanowski, 1987 | Based on data from 188. to 239. K.; AC |
4.76 | 254. | A | Stephenson and Malanowski, 1987 | Based on data from 239. to 298. K.; AC |
5.04 | 226. | N/A | Ruehrwein and Powell, 1946, 3 | Based on data from 183. to 241. K. See also Boublik, Fried, et al., 1984.; AC |
Entropy of vaporization
ΔvapS (cal/mol*K) | Temperature (K) | Reference | Comment |
---|---|---|---|
19.94 | 240.34 | Ruehrwein and Powell, 1946 | P; DH |
Antoine Equation Parameters
log10(P) = A − (B / (T + C))
P = vapor pressure (atm)
T = temperature (K)
View plot Requires a JavaScript / HTML 5 canvas capable browser.
Temperature (K) | A | B | C | Reference | Comment |
---|---|---|---|---|---|
183.12 to 241.07 | 4.04444 | 870.393 | -25.063 | Ruehrwein and Powell, 1946, 3 | Coefficents calculated by NIST from author's data. |
Enthalpy of sublimation
ΔsubH (kcal/mol) | Temperature (K) | Method | Reference | Comment |
---|---|---|---|---|
6.98 | 145. | B | Bondi, 1963 | AC |
6.74 | 128. | A,MS | Tickner and Lossing, 1951, 2 | Based on data from 115. to 141. K.; AC |
Enthalpy of fusion
ΔfusH (kcal/mol) | Temperature (K) | Reference | Comment |
---|---|---|---|
1.301 | 145.57 | Ruehrwein and Powell, 1946 | DH |
1.30 | 145.6 | Domalski and Hearing, 1996 | AC |
Entropy of fusion
ΔfusS (cal/mol*K) | Temperature (K) | Reference | Comment |
---|---|---|---|
8.936 | 145.57 | Ruehrwein and Powell, 1946 | DH |

Henry's Law data

Data compiled by: Rolf Sander
Henry's Law constant (water solution)
kH(T) = k°H exp(d(ln(kH))/d(1/T) ((1/T) - 1/(298.15 K)))
k°H = Henry's law constant for solubility in water at 298.15 K (mol/(kg*bar))
d(ln(kH))/d(1/T) = Temperature dependence constant (K)
k°H (mol/(kg*bar)) | d(ln(kH))/d(1/T) (K) | Method | Reference | Comment |
---|---|---|---|---|
0.013 | Q | N/A | missing citation give several references for the Henry's law constants but don't assign them to specific species. Value at T = 294. K. | |
0.011 | 1700. | L | N/A |

Vibrational and/or electronic energy levels

Data compiled by: Takehiko Shimanouchi
Symmetry: D3h Symmetry Number σ = 6
Sym. | No | Approximate | Selected Freq. | Infrared | Raman | Comments | ||||
---|---|---|---|---|---|---|---|---|---|---|
Species | type of mode | Value | Rating | Value | Phase | Value | Phase | |||
a1' | 1 | CH2 s-str | 3038 | C | ia | 3038 S p | gas | |||
a1' | 2 | CH2 scis | 1479 | D | ia | 1504 W p | gas | FR(2ν14) | ||
a1' | 2 | CH2 scis | 1479 | D | ia | 1453 W p | gas | FR(2ν14) | ||
a1' | 3 | Ring str | 1188 | C | ia | 1188 S p | gas | |||
a1 | 4 | CH2 twist | 1126 | D | 1126 ia VW | gas | 1133 ia | gas | ||
a2' | 5 | CH2 wag | 1070 | D | 1075 ia | sln. | ia | OC(ν5+ν10) | ||
a2 | 6 | CH2 a-str | 3103 | C | 3103 S | gas | ia | |||
a2 | 7 | CH2 rock | 854 | C | 854 S | gas | ia | |||
e' | 8 | CH2 s-str | 3025 | C | 3025 VS | gas | 3020 VS p | gas | ||
e' | 9 | CH2 scis | 1438 | C | 1438 M | gas | 1442 M dp | gas | ||
e' | 10 | CH2 wag | 1029 | C | 1029 S | gas | 1023 VW | liq. | ||
e' | 11 | Ring deform | 866 | C | 866 VS | gas | 866 S dp | gas | ||
e | 12 | CH2 a-str | 3082 | C | ia | 3082 S dp | gas | |||
e | 13 | CH2 twist | 1188 | C | ia | 1188 M dp | gas | |||
e | 14 | CH2 rock | 739 | C | ia | 739 W dp | gas | |||
Source: Shimanouchi, 1972

Kovats' RI, non-polar column, isothermal

Column type | Active phase | Temperature (C) | I | Reference | Comment |
---|---|---|---|---|---|
Capillary | BPX-5 | 30. | 356. | Aflalaye, Sternberg, et al., 1995 | 12. m/0.15 mm/0.25 μm, H2 |
Capillary | BPX-5 | 30. | 357. | Aflalaye, Sternberg, et al., 1995 | 12. m/0.15 mm/0.25 μm, H2 |
Capillary | CP Sil 5 CB | 20. | 348.8 | Do and Raulin, 1992 | 25. m/0.15 mm/2. μm, H2 |
Packed | Squalane | 27. | 344. | Hively and Hinton, 1968 | He, Chromosorb P; Column length: 15. m; Column diameter: 0.25 mm |
Packed | Squalane | 49. | 345. | Hively and Hinton, 1968 | He, Chromosorb P; Column length: 15. m; Column diameter: 0.25 mm |
Packed | Squalane | 67. | 346. | Hively and Hinton, 1968 | He, Chromosorb P; Column length: 15. m; Column diameter: 0.25 mm |
Packed | Squalane | 86. | 347. | Hively and Hinton, 1968 | He, Chromosorb P; Column length: 15. m; Column diameter: 0.25 mm |

Van Den Dool and Kratz RI, non-polar column, custom temperature program

Column type | Active phase | I | Reference | Comment |
---|---|---|---|---|
Packed | SE-30 | 367. | Peng, Ding, et al., 1988 | Supelcoport; Chromosorb; Column length: 3.05 m; Program: 40C(5min) => 10C/min => 200C or 250C (60min) |

Normal alkane RI, non-polar column, temperature ramp

Column type | Active phase | I | Reference | Comment |
---|---|---|---|---|
Capillary | OV-101 | 331. | Zenkevich, 2005 | 25. m/0.20 mm/0.10 μm, N2/He, 6. K/min; Tstart: 50. C; Tend: 250. C |

Normal alkane RI, non-polar column, custom temperature program

Column type | Active phase | I | Reference | Comment |
---|---|---|---|---|
Capillary | Polydimethyl siloxanes | 331. | Zenkevich, Chupalov, et al., 1996 | Program: not specified |
Packed | SE-30 | 351. | Robinson and Odell, 1971 | N2, Chromosorb W; Column length: 6.1 m; Program: 50C910min) => 20C/min => 90(6min) => 10C/min => 150C(hold) |

Normal alkane RI, polar column, custom temperature program

Column type | Active phase | I | Reference | Comment |
---|---|---|---|---|
Capillary | DB-Wax | 405. | Peng, Yang, et al., 1991 | Program: not specified |

References

Lacher, Walden, et al., 1950
Lacher, J.R.; Walden, C.H.; Lea, K.R.; Park, J.D.,
Vapor phase heats of hydrobromination of cyclopropane and propylene,
J. Am. Chem. Soc., 1950, 72, 331-333. [all data]
Knowlton and Rossini, 1949
Knowlton, J.W.; Rossini, F.D.,
Heats of combustion and formation of cyclopropane,
J. Res. NBS, 1949, 43, 113-115. [all data]
Dorofeeva O.V., 1986
Dorofeeva O.V.,
Thermodynamic properties of twenty-one monocyclic hydrocarbons,
J. Phys. Chem. Ref. Data, 1986, 15, 437-464. [all data]
Kobe K.A., 1950
Kobe K.A.,
Thermochemistry for the petrochemical industry. XIV. Some miscellaneous hydrocarbons,
Petrol. Refiner, 1950, 29 (12), 93-96. [all data]
Kistiakowsky G.B., 1940
Kistiakowsky G.B.,
Gaseous heat capacities. II,
J. Chem. Phys., 1940, 8, 610-618. [all data]
Kistiakowsky G.B., 1940, 2
Kistiakowsky G.B.,
The low temperature gaseous heat capacities of certain C3 hydrocarbons,
J. Chem. Phys., 1940, 8, 970-977. [all data]
Lacher, Kianpour, et al., 1957
Lacher, J.R.; Kianpour, A.; Park, J.D.,
Reaction heats of organic halogen compounds. X. Vapor phase heats of hydrobromination of cyclopropane and propylene,
J. Phys. Chem., 1957, 61, 1124-1125. [all data]
Benson and Amano, 1962
Benson, S.W.; Amano, A.,
Thermodynamics of iodine addition to ethylene, propylene, and cyclopropane,
J. Chem. Phys., 1962, 36, 3464-3471. [all data]
Hunter and Lias, 1998
Hunter, E.P.; Lias, S.G.,
Evaluated Gas Phase Basicities and Proton Affinities of Molecules: An Update,
J. Phys. Chem. Ref. Data, 1998, 27, 3, 413-656, https://doi.org/10.1063/1.556018
. [all data]
Traeger, 1984
Traeger, J.C.,
A study of the allyl cation thermochemistry by photoionization mass spectrometry,
Int. J. Mass Spectrom. Ion Processes, 1984, 58, 259. [all data]
Lias and Buckley, 1984
Lias, S.G.; Buckley, T.J.,
Structures and reactions of C3H6+ ions generated in cyclopropane,
Int. J. Mass Spectrom. Ion Processes, 1984, 56, 123. [all data]
Kimura, Katsumata, et al., 1981
Kimura, K.; Katsumata, S.; Achiba, Y.; Yamazaki, T.; Iwata, S.,
Ionization energies, Ab initio assignments, and valence electronic structure for 200 molecules
in Handbook of HeI Photoelectron Spectra of Fundamental Organic Compounds, Japan Scientific Soc. Press, Tokyo, 1981. [all data]
Bieri, Burger, et al., 1977
Bieri, G.; Burger, F.; Heilbronner, E.; Maier, J.P.,
Valence ionization enrgies of hydrocarbons,
Helv. Chim. Acta, 1977, 60, 2213. [all data]
Rothgery, Holt, et al., 1975
Rothgery, E.F.; Holt, J.; McGee, H.A., Jr.,
Cryochemical synthesis and molecular energetics of cyclopropanone and some related compounds,
J. Am. Chem. Soc., 1975, 97, 4971. [all data]
Krassig, Reinke, et al., 1974
Krassig, R.; Reinke, D.; Baumgartel, H.,
Photo-reaktionen kleiner organischer molekule II. Die photoionenspektren der Isomeren propylen-cyclopropan und acetaldehyd-athylenoxyd,
Ber. Bunsen-Ges. Phys. Chem., 1974, 78, 425. [all data]
Lossing, 1972
Lossing, F.P.,
Free radicals by mass spectrometry. XLV. Ionization potentials and heats of formation of C3H3, C3H5, and C4H7 radicals and ions,
Can. J. Chem., 1972, 50, 3973. [all data]
Basch, Robin, et al., 1969
Basch, H.; Robin, M.B.; Kuebler, N.A.; Baker, C.; Turner, D.W.,
Optical and photoelectron spectra of small rings. III. The saturated three-membered rings,
J. Chem. Phys., 1969, 51, 52. [all data]
Cermak, 1968
Cermak, V.,
Penning ionization electron spectroscopy. I. Determination of ionization potentials of polyatomic molecules,
Collection Czech. Chem. Commun., 1968, 33, 2739. [all data]
Watanabe, Nakayama, et al., 1962
Watanabe, K.; Nakayama, T.; Mottl, J.,
Ionization potentials of some molecules,
J. Quant. Spectry. Radiative Transfer, 1962, 2, 369. [all data]
Plemenkov, Villem, et al., 1981
Plemenkov, V.V.; Villem, Y.Y.; Villem, N.V.; Bolesov, I.G.; Surmina, L.S.; Yakushkina, N.I.; Formanovskii, A.A.,
Photoelectron spectra of polyalkylcyclopropenes and polyalkylcyclopropanes,
Zh. Obshch. Khim., 1981, 51, 2076. [all data]
Haney and Franklin, 1968
Haney, M.A.; Franklin, J.L.,
Correlation of excess energies of electron-impact dissociations with the translational energies of the products,
J.Chem. Phys., 1968, 48, 4093. [all data]
Harrison and Tait, 1962
Harrison, A.G.; Tait, J.M.S.,
Concurrent ion-molecule reactions leading to the same product ion,
Can. J. Chem., 1962, 40, 1986. [all data]
Buttrill, Williamson, et al., 1975
Buttrill, S.E., Jr.; Williamson, A.D.; LeBreton, P.,
Photoionization measurement of the heat of formation of allyl cations,
J. Chem. Phys., 1975, 62, 1586. [all data]