1-Phosphaethyne, 2-(trimethylsilyl)-

Gas phase ion energetics data

Data compiled by: Sharon G. Lias, John E. Bartmess, Joel F. Liebman, John L. Holmes, Rhoda D. Levin, and W. Gary Mallard

Ionization energy determinations

IE (eV) Method Reference Comment
9.6PESolouki, Bock, et al., 1982
9.9PESolouki, Bock, et al., 1982Vertical value

References

Solouki, Bock, et al., 1982
Solouki, B.; Bock, H.; Appel, R.; Westerhaus, A.; Becker, G.; Uhl, G., Photoelektronen-spektren von methylidinphosphanen R-CP, Chem. Ber., 1982, 115, 3747. [all data]