Isocyanic acid
- Formula: CHNO
- Molecular weight: 43.0247
- IUPAC Standard InChIKey: OWIKHYCFFJSOEH-UHFFFAOYSA-N
- CAS Registry Number: 75-13-8
- Chemical structure:
View 3d structure (requires JavaScript / HTML 5) - Permanent link for this species. Use this link for bookmarking this species for future reference.

Gas phase thermochemistry data

Data compiled as indicated in comments:
ALS - Hussein Y. Afeefy, Joel F. Liebman, and Stephen E. Stein
Quantity | Value | Units | Method | Reference | Comment |
---|---|---|---|---|---|
ΔfH°gas | -101.67 | kJ/mol | Review | Chase, 1998 | Data last reviewed in December, 1970 |
ΔfH°gas | -97. ± 13. | kJ/mol | Ion | Okabe, 1970 | ALS |
Quantity | Value | Units | Method | Reference | Comment |
S°gas,1 bar | 238.22 | J/mol*K | Review | Chase, 1998 | Data last reviewed in December, 1970 |
Gas Phase Heat Capacity (Shomate Equation)
Cp° = A + B*t + C*t2 + D*t3 +
E/t2
H° − H°298.15= A*t + B*t2/2 +
C*t3/3 + D*t4/4 − E/t + F − H
S° = A*ln(t) + B*t + C*t2/2 + D*t3/3 −
E/(2*t2) + G
Cp = heat capacity (J/mol*K)
H° = standard enthalpy (kJ/mol)
S° = standard entropy (J/mol*K)
t = temperature (K) / 1000.
View plot Requires a JavaScript / HTML 5 canvas capable browser.
Temperature (K) | 298. to 1200. | 1200. to 6000. |
---|---|---|
A | 32.73428 | 71.59786 |
B | 63.81479 | 5.912034 |
C | -38.46142 | -1.122839 |
D | 9.728052 | 0.074171 |
E | -0.317587 | -9.813573 |
F | -115.0136 | -144.3811 |
G | 258.6482 | 296.4201 |
H | -101.6712 | -101.6712 |
Reference | Chase, 1998 | Chase, 1998 |
Comment | Data last reviewed in December, 1970 | Data last reviewed in December, 1970 |

Reaction thermochemistry data

Data compiled by: John E. Bartmess
Individual Reactions
CNO- + =
Quantity | Value | Units | Method | Reference | Comment |
---|---|---|---|---|---|
ΔrH° | 1427.5 ± 2.6 | kJ/mol | D-EA | Bradforth, Kim, et al., 1993 | gas phase; D-EA cycle requires a DH ca 4 kcal/mol weaker |
ΔrH° | 1442. ± 8.8 | kJ/mol | G+TS | Wight and Beauchamp, 1980 | gas phase |
Quantity | Value | Units | Method | Reference | Comment |
ΔrG° | 1400.6 ± 3.0 | kJ/mol | H-TS | Bradforth, Kim, et al., 1993 | gas phase; D-EA cycle requires a DH ca 4 kcal/mol weaker |
ΔrG° | 1415. ± 8.4 | kJ/mol | IMRE | Wight and Beauchamp, 1980 | gas phase |
(CAS Reg. No. 1140500-24-8 • 4294967295) +
= CAS Reg. No. 1140500-24-8
By formula: (CAS Reg. No. 1140500-24-8 • 4294967295CHNO) + CHNO = CAS Reg. No. 1140500-24-8
Quantity | Value | Units | Method | Reference | Comment |
---|---|---|---|---|---|
ΔrH° | 180. ± 13. | kJ/mol | N/A | Taft, 1987 | gas phase; value altered from reference due to change in acidity scale |
(CAS Reg. No. 67131-48-0 • 4294967295) +
= CAS Reg. No. 67131-48-0
By formula: (CAS Reg. No. 67131-48-0 • 4294967295CHNO) + CHNO = CAS Reg. No. 67131-48-0
Quantity | Value | Units | Method | Reference | Comment |
---|---|---|---|---|---|
ΔrH° | 243. ± 9.2 | kJ/mol | N/A | Taft, 1987 | gas phase; value altered from reference due to change in acidity scale |

Gas phase ion energetics data

Data evaluated as indicated in comments:
HL - Edward P. Hunter and Sharon G. Lias
L - Sharon G. Lias
Data compiled as indicated in comments:
B - John E. Bartmess
LL - Sharon G. Lias and Joel F. Liebman
LLK - Sharon G. Lias, Rhoda D. Levin, and Sherif A. Kafafi
RDSH - Henry M. Rosenstock, Keith Draxl, Bruce W. Steiner, and John T. Herron
Quantity | Value | Units | Method | Reference | Comment |
---|---|---|---|---|---|
IE (evaluated) | 11.595 ± 0.005 | eV | N/A | N/A | L |
Quantity | Value | Units | Method | Reference | Comment |
Proton affinity (review) | 753. | kJ/mol | N/A | Hunter and Lias, 1998 | HL |
Quantity | Value | Units | Method | Reference | Comment |
Gas basicity | 718.8 | kJ/mol | N/A | Hunter and Lias, 1998 | HL |
Ionization energy determinations
IE (eV) | Method | Reference | Comment |
---|---|---|---|
11.595 ± 0.005 | PI | Ruscic and Berkowitz, 1994 | LL |
11.62 ± 0.02 | PE | Cradock, Ebsworth, et al., 1972 | LLK |
11.60 ± 0.01 | PE | Rowland, Eland, et al., 1968 | RDSH |
Appearance energy determinations
Ion | AE (eV) | Other Products | Method | Reference | Comment |
---|---|---|---|---|---|
CHO+ | 15.52 | N | EI | Compernolle, 1975 | LLK |
CHO+ | 15.76 ± 0.15 | N | EI | Bogan and Hand, 1971 | LLK |
CNO+ | ≤16.532 | H | PI | Ruscic and Berkowitz, 1994 | LL |
CNO+ | 16.66 ± 0.15 | H | EI | Bogan and Hand, 1971 | LLK |
CNO+ | ≤16.1 | H | EI | Rowland, Eland, et al., 1968 | RDSH |
NH+ | 17.26 ± 0.15 | CO | EI | Bogan and Hand, 1971 | LLK |
NH+ | ≤17.7 | CO | EI | Rowland, Eland, et al., 1968 | RDSH |
NO+ | 15.76 ± 0.15 | ? | EI | Bogan and Hand, 1971 | LLK |
De-protonation reactions
CNO- + =
Quantity | Value | Units | Method | Reference | Comment |
---|---|---|---|---|---|
ΔrH° | 1427.5 ± 2.6 | kJ/mol | D-EA | Bradforth, Kim, et al., 1993 | gas phase; D-EA cycle requires a DH ca 4 kcal/mol weaker; B |
ΔrH° | 1442. ± 8.8 | kJ/mol | G+TS | Wight and Beauchamp, 1980 | gas phase; B |
Quantity | Value | Units | Method | Reference | Comment |
ΔrG° | 1400.6 ± 3.0 | kJ/mol | H-TS | Bradforth, Kim, et al., 1993 | gas phase; D-EA cycle requires a DH ca 4 kcal/mol weaker; B |
ΔrG° | 1415. ± 8.4 | kJ/mol | IMRE | Wight and Beauchamp, 1980 | gas phase; B |

References

Chase, 1998
Chase, M.W., Jr.,
NIST-JANAF Themochemical Tables, Fourth Edition,
J. Phys. Chem. Ref. Data, Monograph 9, 1998, 1-1951. [all data]
Okabe, 1970
Okabe, H.,
Photodissociation of HNCO in the vacuum ultraviolet; production of NCO A2Σ and NH (A3π, πC1),
J. Chem. Phys., 1970, 53, 3507-3515. [all data]
Bradforth, Kim, et al., 1993
Bradforth, S.E.; Kim, E.H.; Arnold, D.W.; Neumark, D.M.,
Photoelectron Spectroscopy of CN-, NCO-, and NCS-,
J. Chem. Phys., 1993, 98, 2, 800, https://doi.org/10.1063/1.464244
. [all data]
Wight and Beauchamp, 1980
Wight, C.A.; Beauchamp, J.L.,
Acidity, basicity, and ion/molecule reactions of isocyanic acid in the gas phase by ICR spectroscopy,
J. Phys. Chem., 1980, 84, 2503. [all data]
Taft, 1987
Taft, R.W.,
The Nature and Analysis of Substitutent Electronic Effects,
Personal communication. See also Prog. Phys. Org. Chem., 1987, 16, 1. [all data]
Hunter and Lias, 1998
Hunter, E.P.; Lias, S.G.,
Evaluated Gas Phase Basicities and Proton Affinities of Molecules: An Update,
J. Phys. Chem. Ref. Data, 1998, 27, 3, 413-656, https://doi.org/10.1063/1.556018
. [all data]
Ruscic and Berkowitz, 1994
Ruscic, B.; Berkowitz, J.,
The H-NCO bond energy and Hf(NCO) from photoionization mass spectrometric studies of HNCO and NCO,
J. Chem. Phys., 1994, 100, 4498. [all data]
Cradock, Ebsworth, et al., 1972
Cradock, S.; Ebsworth, E.A.V.; Murdoch, J.D.,
Photoelectron spectra of some Group 4 pseudohalides and related compounds,
J. Chem. Soc. Faraday Trans. 2, 1972, 68, 86. [all data]
Rowland, Eland, et al., 1968
Rowland, C.G.; Eland, J.H.D.; Danby, C.J.,
A spin-forbidden predissociation in the mass spectrum of isocyanic acid,
Chem. Commun., 1968, 1535. [all data]
Compernolle, 1975
Compernolle, F.,
Mass spectrum and heat of formation of isocyanic acid. Production of [HCO]+ from discrete electronic state of molecular ion,
Org. Mass Spectrom., 1975, 10, 289. [all data]
Bogan and Hand, 1971
Bogan, D.J.; Hand, C.W.,
Mass spectrum of isocyanic acid,
J. Phys. Chem., 1971, 75, 1532. [all data]