Acetaldehyde
- Formula: C2H4O
- Molecular weight: 44.0526
- IUPAC Standard InChIKey: IKHGUXGNUITLKF-UHFFFAOYSA-N
- CAS Registry Number: 75-07-0
- Chemical structure:
View 3d structure (requires JavaScript / HTML 5) - Other names: Acetic aldehyde; Ethanal; Ethyl aldehyde; CH3CHO; Acetaldehyd; Aldehyde acetique; Aldeide acetica; NCI-C56326; Octowy aldehyd; Acetylaldehyde; Rcra waste number U001; UN 1089; NSC 7594

Gas phase thermochemistry data

Data compiled as indicated in comments:
ALS - Hussein Y. Afeefy, Joel F. Liebman, and Stephen E. Stein
GT - Glushko Thermocenter, Russian Academy of Sciences, Moscow
Quantity | Value | Units | Method | Reference | Comment |
---|---|---|---|---|---|
ΔfH°gas | -40.80 ± 0.35 | kcal/mol | Chyd | Wiberg, Crocker, et al., 1991 | ALS |
Constant pressure heat capacity of gas
Cp,gas (cal/mol*K) | Temperature (K) | Reference | Comment |
---|---|---|---|
8.492 | 50. | Thermodynamics Research Center, 1997 | 1 bar. Recommended heat capacity and entropy values are in good agreement with statistically calculated values of [ Pitzer K.S., 1949, 66LIP/WAG]. Discrepancies with results of calculation [ Della Vedova C.O., 1991] amount to 1.4 J/mol*K for S(300 K) and 3.4 J/mol*K for Cp(900 K). S(298.15 K) value calculated by high accuracy ab initio method [ East A.L.L., 1997] is in close agreement with selected one. Please also see Chao J., 1980, Chao J., 1986.; GT |
9.625 | 100. | ||
10.34 | 150. | ||
11.11 | 200. | ||
12.62 | 273.15 | ||
13.22 ± 0.02 | 298.15 | ||
13.27 | 300. | ||
15.84 | 400. | ||
18.33 | 500. | ||
20.54 | 600. | ||
22.48 | 700. | ||
24.156 | 800. | ||
25.619 | 900. | ||
26.886 | 1000. | ||
27.983 | 1100. | ||
28.934 | 1200. | ||
29.756 | 1300. | ||
30.471 | 1400. | ||
31.092 | 1500. | ||
32.318 | 1750. | ||
33.207 | 2000. | ||
33.862 | 2250. | ||
34.357 | 2500. | ||
34.739 | 2750. | ||
35.036 | 3000. |
Constant pressure heat capacity of gas
Cp,gas (cal/mol*K) | Temperature (K) | Reference | Comment |
---|---|---|---|
13.14 | 298.1 | Chao J., 1986 | These ideal gas heat capacity values were obtained from the observed values of [ Coleman C.F., 1949] using the second virial coefficient data from [ Pitzer K.S., 1949].; GT |
13.87 | 322.9 | ||
14.92 | 372.7 | ||
16.12 | 422.4 |

Condensed phase thermochemistry data

Data compiled as indicated in comments:
ALS - Hussein Y. Afeefy, Joel F. Liebman, and Stephen E. Stein
DH - Eugene S. Domalski and Elizabeth D. Hearing
Quantity | Value | Units | Method | Reference | Comment |
---|---|---|---|---|---|
ΔfH°liquid | -46.95 ± 0.35 | kcal/mol | Chyd | Wiberg, Crocker, et al., 1991 | ALS |
Quantity | Value | Units | Method | Reference | Comment |
S°liquid | 28.04 | cal/mol*K | N/A | Lebedev and Vasil'ev, 1988 | DH |
Constant pressure heat capacity of liquid
Cp,liquid (cal/mol*K) | Temperature (K) | Reference | Comment |
---|---|---|---|
21.28 | 298.15 | Lebedev and Vasil'ev, 1988 | T = 15 to 300 K.; DH |
22.99 | 273. | Connor, Elving, et al., 1947 | DH |

Phase change data

Data compiled as indicated in comments:
BS - Robert L. Brown and Stephen E. Stein
TRC - Thermodynamics Research Center, NIST Boulder Laboratories, Chris Muzny director
DRB - Donald R. Burgess, Jr.
AC - William E. Acree, Jr., James S. Chickos
ALS - Hussein Y. Afeefy, Joel F. Liebman, and Stephen E. Stein
DH - Eugene S. Domalski and Elizabeth D. Hearing
CAL - James S. Chickos, William E. Acree, Jr., Joel F. Liebman, Students of Chem 202 (Introduction to the Literature of Chemistry), University of Missouri -- St. Louis
Quantity | Value | Units | Method | Reference | Comment |
---|---|---|---|---|---|
Tboil | 294.0 ± 0.8 | K | AVG | N/A | Average of 25 out of 27 values; Individual data points |
Quantity | Value | Units | Method | Reference | Comment |
Tfus | 151. ± 3. | K | AVG | N/A | Average of 15 values; Individual data points |
Quantity | Value | Units | Method | Reference | Comment |
Tc | 466.0 | K | N/A | Teja and Anselme, 1990 | Uncertainty assigned by TRC = 2. K; TRC |
Tc | 461. | K | N/A | Hollmann, 1903 | Uncertainty assigned by TRC = 2. K; TRC |
Tc | 454.7 | K | N/A | Van der Waals, 1881 | Uncertainty assigned by TRC = 6. K; TRC |
Quantity | Value | Units | Method | Reference | Comment |
ρc | 6.49 | mol/l | N/A | Teja and Anselme, 1990 | Uncertainty assigned by TRC = 0.1 mol/l; TRC |
Quantity | Value | Units | Method | Reference | Comment |
ΔvapH° | 6.243 | kcal/mol | N/A | Majer and Svoboda, 1985 | |
ΔvapH° | 6.14 | kcal/mol | N/A | Wiberg, Crocker, et al., 1991 | DRB |
ΔvapH° | 6.43 | kcal/mol | EB | Bull, Seregrennaja, et al., 1963 | Based on data from 293. to 377. K. See also Verevkin, Krasnykh, et al., 2003.; AC |
Enthalpy of vaporization
ΔvapH (kcal/mol) | Temperature (K) | Method | Reference | Comment |
---|---|---|---|---|
6.157 | 293.3 | N/A | Majer and Svoboda, 1985 | |
6.21 | 308. | A | Stephenson and Malanowski, 1987 | Based on data from 293. to 377. K.; AC |
6.60 | 283. | A | Stephenson and Malanowski, 1987 | Based on data from 272. to 294. K. See also Dykyj, 1970.; AC |
6.29 | 308. | N/A | Kim and Kim, 1977 | Based on data from 293. to 345. K.; AC |
6.45 | 307. | N/A | Coles and Popper, 1950 | Based on data from 273. to 307. K.; AC |
6.15 ± 0.05 | 294. | V | Coleman and DeVries, 1949 | ALS |
Antoine Equation Parameters
log10(P) = A − (B / (T + C))
P = vapor pressure (atm)
T = temperature (K)
View plot Requires a JavaScript / HTML 5 canvas capable browser.
Temperature (K) | A | B | C | Reference | Comment |
---|---|---|---|---|---|
293.4 to 377.5 | 3.68068 | 822.894 | -69.899 | Bull, Seregrennaja, et al., 1963, 2 | Coefficents calculated by NIST from author's data. |
272.9 to 307.6 | 5.1826 | 1637.083 | 22.317 | Coles and Popper, 1950 | Coefficents calculated by NIST from author's data. |
Enthalpy of fusion
ΔfusH (kcal/mol) | Temperature (K) | Reference | Comment |
---|---|---|---|
0.5521 | 149.78 | Lebedev and Vasil'ev, 1988 | DH |
0.411 | 242.9 | Domalski and Hearing, 1996 | AC |
Entropy of fusion
ΔfusS (cal/mol*K) | Temperature (K) | Reference | Comment |
---|---|---|---|
3.688 | 149.78 | Lebedev and Vasil'ev, 1988 | DH |
Entropy of fusion
ΔfusS (cal/mol*K) | Temperature (K) | Reference | Comment |
---|---|---|---|
3.685 | 149.8 | Domalski and Hearing, 1996 | CAL |
1.69 | 242.9 |
Enthalpy of phase transition
ΔHtrs (kcal/mol) | Temperature (K) | Initial Phase | Final Phase | Reference | Comment |
---|---|---|---|---|---|
0.4101 | 242.9 | liquid | liquid | Lebedev and Vasil'ev, 1988 | Lambda type transition.; DH |
Entropy of phase transition
ΔStrs (cal/mol*K) | Temperature (K) | Initial Phase | Final Phase | Reference | Comment |
---|---|---|---|---|---|
1.76 | 242.9 | liquid | liquid | Lebedev and Vasil'ev, 1988 | Lambda; DH |

Reaction thermochemistry data

Data compiled as indicated in comments:
B - John E. Bartmess
M - Michael M. Meot-Ner (Mautner) and Sharon G. Lias
ALS - Hussein Y. Afeefy, Joel F. Liebman, and Stephen E. Stein
RCD - Robert C. Dunbar
Individual Reactions
C2H3O- + =
By formula: C2H3O- + H+ = C2H4O
Quantity | Value | Units | Method | Reference | Comment |
---|---|---|---|---|---|
ΔrH° | 366.42 ± 0.81 | kcal/mol | D-EA | Mead, Lykke, et al., 1984 | gas phase; Uncertainty: 6 millical/mol (0.26 micro-eV).Dipolebound state at ca. 14.3 cal/mol (5 cm-1); B |
ΔrH° | 365.8 ± 2.2 | kcal/mol | G+TS | Bartmess, Scott, et al., 1979 | gas phase; Acid: ethanal. The enol is 9.6 kcal/mol more acidic: Holmes and Lossing, 1982; value altered from reference due to change in acidity scale; B |
ΔrH° | 366.5 ± 2.9 | kcal/mol | G+TS | Cumming and Kebarle, 1978 | gas phase; B |
Quantity | Value | Units | Method | Reference | Comment |
ΔrG° | 359.6 ± 1.2 | kcal/mol | H-TS | Mead, Lykke, et al., 1984 | gas phase; Uncertainty: 6 millical/mol (0.26 micro-eV).Dipolebound state at ca. 14.3 cal/mol (5 cm-1); B |
ΔrG° | 359.0 ± 2.0 | kcal/mol | IMRE | Bartmess, Scott, et al., 1979 | gas phase; Acid: ethanal. The enol is 9.6 kcal/mol more acidic: Holmes and Lossing, 1982; value altered from reference due to change in acidity scale; B |
ΔrG° | 359.7 ± 2.0 | kcal/mol | IMRE | Cumming and Kebarle, 1978 | gas phase; B |
By formula: C2H5O+ + C2H4O = (C2H5O+ • C2H4O)
Bond type: Hydrogen bonds of the type OH-O between organics
Quantity | Value | Units | Method | Reference | Comment |
---|---|---|---|---|---|
ΔrH° | 29.0 | kcal/mol | ICR | Larson and McMahon, 1982 | gas phase; switching reaction((CH3)2OH+)(CH3)2O, Entropy change calculated or estimated; Grimsrud and Kebarle, 1973, Lias, Liebman, et al., 1984, Keesee and Castleman, 1986; M |
Quantity | Value | Units | Method | Reference | Comment |
ΔrS° | 26.2 | cal/mol*K | N/A | Larson and McMahon, 1982 | gas phase; switching reaction((CH3)2OH+)(CH3)2O, Entropy change calculated or estimated; Grimsrud and Kebarle, 1973, Lias, Liebman, et al., 1984, Keesee and Castleman, 1986; M |
Quantity | Value | Units | Method | Reference | Comment |
ΔrG° | 21.2 | kcal/mol | ICR | Larson and McMahon, 1982 | gas phase; switching reaction((CH3)2OH+)(CH3)2O, Entropy change calculated or estimated; Grimsrud and Kebarle, 1973, Lias, Liebman, et al., 1984, Keesee and Castleman, 1986; M |
By formula: C2H7O+ + C2H4O = (C2H7O+ • C2H4O)
Bond type: Hydrogen bonds of the type OH-O between organics
Quantity | Value | Units | Method | Reference | Comment |
---|---|---|---|---|---|
ΔrH° | 31.2 | kcal/mol | ICR | Larson and McMahon, 1982 | gas phase; switching reaction((CH3)2OH+)(CH3)2O, Entropy change calculated or estimated; Grimsrud and Kebarle, 1973, Lias, Liebman, et al., 1984, Keesee and Castleman, 1986; M |
Quantity | Value | Units | Method | Reference | Comment |
ΔrS° | 26.9 | cal/mol*K | N/A | Larson and McMahon, 1982 | gas phase; switching reaction((CH3)2OH+)(CH3)2O, Entropy change calculated or estimated; Grimsrud and Kebarle, 1973, Lias, Liebman, et al., 1984, Keesee and Castleman, 1986; M |
Quantity | Value | Units | Method | Reference | Comment |
ΔrG° | 23.2 | kcal/mol | ICR | Larson and McMahon, 1982 | gas phase; switching reaction((CH3)2OH+)(CH3)2O, Entropy change calculated or estimated; Grimsrud and Kebarle, 1973, Lias, Liebman, et al., 1984, Keesee and Castleman, 1986; M |
By formula: C2H5O+ + C2H4O = (C2H5O+ • C2H4O)
Bond type: Hydrogen bonds of the type OH-O between organics
Quantity | Value | Units | Method | Reference | Comment |
---|---|---|---|---|---|
ΔrH° | 31.9 | kcal/mol | ICR | Larson and McMahon, 1982 | gas phase; switching reaction((CH3)2OH+)(CH3)2O, Entropy change calculated or estimated; Grimsrud and Kebarle, 1973, Lias, Liebman, et al., 1984; M |
Quantity | Value | Units | Method | Reference | Comment |
ΔrS° | 29.0 | cal/mol*K | N/A | Larson and McMahon, 1982 | gas phase; switching reaction((CH3)2OH+)(CH3)2O, Entropy change calculated or estimated; Grimsrud and Kebarle, 1973, Lias, Liebman, et al., 1984; M |
Quantity | Value | Units | Method | Reference | Comment |
ΔrG° | 23.3 | kcal/mol | ICR | Larson and McMahon, 1982 | gas phase; switching reaction((CH3)2OH+)(CH3)2O, Entropy change calculated or estimated; Grimsrud and Kebarle, 1973, Lias, Liebman, et al., 1984; M |
C2H3O- + =
By formula: C2H3O- + H+ = C2H4O
Quantity | Value | Units | Method | Reference | Comment |
---|---|---|---|---|---|
ΔrH° | 393.19 ± 0.96 | kcal/mol | D-EA | Nimlos, Soderquist, et al., 1989 | gas phase; B |
ΔrH° | 391.0 ± 2.1 | kcal/mol | G+TS | DePuy, Bierbaum, et al., 1985 | gas phase; B |
ΔrH° | 387.0 ± 8.0 | kcal/mol | CIDT | Graul and Squires, 1990 | gas phase; B |
ΔrH° | <382.00 | kcal/mol | CIDT | Graul and Squires, 1988 | gas phase; B |
Quantity | Value | Units | Method | Reference | Comment |
ΔrG° | 385.4 ± 1.1 | kcal/mol | H-TS | Nimlos, Soderquist, et al., 1989 | gas phase; B |
ΔrG° | 383.3 ± 2.0 | kcal/mol | IMRB | DePuy, Bierbaum, et al., 1985 | gas phase; B |
ΔrG° | <374.25 ± 0.60 | kcal/mol | H-TS | Graul and Squires, 1988 | gas phase; B |
By formula: Cl- + C2H4O = (Cl- • C2H4O)
Quantity | Value | Units | Method | Reference | Comment |
---|---|---|---|---|---|
ΔrH° | 14.4 ± 2.0 | kcal/mol | IMRE | Larson and McMahon, 1984 | gas phase; B,M |
Quantity | Value | Units | Method | Reference | Comment |
ΔrS° | 21.7 | cal/mol*K | N/A | Larson and McMahon, 1984 | gas phase; switching reaction(Cl-)t-C4H9F, Entropy change calculated or estimated; Larson and McMahon, 1984, 2; M |
Quantity | Value | Units | Method | Reference | Comment |
ΔrG° | 7.9 ± 2.0 | kcal/mol | IMRE | Larson and McMahon, 1984 | gas phase; B,M |
By formula: C2H3O2- + C2H4O = (C2H3O2- • C2H4O)
Bond type: Hydrogen bonds of deprotonated acids to ketones/
Quantity | Value | Units | Method | Reference | Comment |
---|---|---|---|---|---|
ΔrH° | 16.3 ± 1.0 | kcal/mol | TDAs | Meot-ner, 1988 | gas phase; B,M |
Quantity | Value | Units | Method | Reference | Comment |
ΔrS° | 21.7 | cal/mol*K | PHPMS | Meot-ner, 1988 | gas phase; M |
Quantity | Value | Units | Method | Reference | Comment |
ΔrG° | 9.8 ± 2.0 | kcal/mol | TDAs | Meot-ner, 1988 | gas phase; B |
By formula: H2 + C2H4O = C2H6O
Quantity | Value | Units | Method | Reference | Comment |
---|---|---|---|---|---|
ΔrH° | -19.44 ± 0.34 | kcal/mol | Chyd | Wiberg, Crocker, et al., 1991 | liquid phase; solvent: Triglyme; ALS |
ΔrH° | -16.51 ± 0.10 | kcal/mol | Chyd | Dolliver, Gresham, et al., 1938 | gas phase; Reanalyzed by Cox and Pilcher, 1970, Original value = -16.8 ± 0.1 kcal/mol; At 355 °K; ALS |
(C2H5O- • 4294967295) +
= C2H5O-
By formula: (C2H5O- • 4294967295C2H4O) + C2H4O = C2H5O-
Quantity | Value | Units | Method | Reference | Comment |
---|---|---|---|---|---|
ΔrH° | 37.7 ± 1.0 | kcal/mol | N/A | Ramond, Davico, et al., 2000 | gas phase; B |
ΔrH° | 39.5 ± 2.2 | kcal/mol | Ther | Bartmess, Scott, et al., 1979 | gas phase; value altered from reference due to change in acidity scale; B |
By formula: NO- + C2H4O = (NO- • C2H4O)
Quantity | Value | Units | Method | Reference | Comment |
---|---|---|---|---|---|
ΔrH° | 39.1 | kcal/mol | ICR | Reents and Freiser, 1981 | gas phase; switching reaction,Thermochemical ladder(NO+)C2H5OH, Entropy change calculated or estimated; Farid and McMahon, 1978; M |
By formula: Li+ + C2H4O = (Li+ • C2H4O)
Quantity | Value | Units | Method | Reference | Comment |
---|---|---|---|---|---|
ΔrH° | 41.3 | kcal/mol | ICR | Staley and Beauchamp, 1975 | gas phase; switching reaction(Li+)H2O, Keesee and Castleman, 1986 from Berman and Beauchamp, 1986; Dzidic and Kebarle, 1970 interpolated; M |
By formula: 3C2H4O = C6H12O3
Quantity | Value | Units | Method | Reference | Comment |
---|---|---|---|---|---|
ΔrH° | -21. ± 1. | kcal/mol | Cm | Krasnov, Ozherel'eva, et al., 1983 | liquid phase; solvent: Nonaqueous; Trimerization; ALS |
ΔrH° | -23.4 | kcal/mol | Eqk | Busfield, Lee, et al., 1973 | gas phase; ALS |
By formula: Mg+ + C2H4O = (Mg+ • C2H4O)
Quantity | Value | Units | Method | Reference | Comment |
---|---|---|---|---|---|
ΔrH° | 63. ± 5. | kcal/mol | ICR | Operti, Tews, et al., 1988 | gas phase; switching reaction,Thermochemical ladder(Mg+)CH3OH; M |
By formula: C4H10O2 + H2O = 2CH4O + C2H4O
Quantity | Value | Units | Method | Reference | Comment |
---|---|---|---|---|---|
ΔrH° | 8.622 ± 0.015 | kcal/mol | Cm | Wiberg, 1980 | liquid phase; solvent: Water; Hydrolysis; ALS |
By formula: C4H10O2 + H2O = 2CH4O + C2H4O
Quantity | Value | Units | Method | Reference | Comment |
---|---|---|---|---|---|
ΔrH° | 8.54 ± 0.07 | kcal/mol | Cm | Birley and Skinner, 1970 | liquid phase; Heat of hydrolysis; ALS |
By formula: C4H10O2 + H2O = 2CH4O + C2H4O
Quantity | Value | Units | Method | Reference | Comment |
---|---|---|---|---|---|
ΔrH° | 8.6 ± 0.2 | kcal/mol | Eqk | Wiberg, Morgan, et al., 1994 | liquid phase; ALS |
By formula: 2CH4O + C2H4O = C4H10O2 + H2O
Quantity | Value | Units | Method | Reference | Comment |
---|---|---|---|---|---|
ΔrH° | -14.8 ± 0.3 | kcal/mol | Cm | Wiberg, Morgan, et al., 1994 | gas phase; ALS |
By formula: C2H4O + I2 = HI + C2H3IO
Quantity | Value | Units | Method | Reference | Comment |
---|---|---|---|---|---|
ΔrH° | 0.7 ± 0.5 | kcal/mol | Eqk | Walsh and Benson, 1966 | gas phase; ALS |
By formula: H2O + C8H10N2 = C6H8N2 + C2H4O
Quantity | Value | Units | Method | Reference | Comment |
---|---|---|---|---|---|
ΔrH° | -14.6 | kcal/mol | Cm | Landrieu, 1905 | solid phase; ALS |
By formula: C6H12O3 = 3C2H4O
Quantity | Value | Units | Method | Reference | Comment |
---|---|---|---|---|---|
ΔrH° | 23.4 | kcal/mol | Eqk | Busfield, Lee, et al., 1973 | gas phase; At 292-313 K; ALS |
By formula: Na+ + C2H4O = (Na+ • C2H4O)
Quantity | Value | Units | Method | Reference | Comment |
---|---|---|---|---|---|
ΔrH° | 27.1 ± 0.8 | kcal/mol | CIDT | Armentrout and Rodgers, 2000 | RCD |
By formula: Ag+ + C2H4O = (Ag+ • C2H4O)
Quantity | Value | Units | Method | Reference | Comment |
---|---|---|---|---|---|
ΔrH° | 43.5 ± 4.5 | kcal/mol | RAK | Ho, Yang, et al., 1997 | RCD |

Henry's Law data

Data compiled by: Rolf Sander
Henry's Law constant (water solution)
kH(T) = k°H exp(d(ln(kH))/d(1/T) ((1/T) - 1/(298.15 K)))
k°H = Henry's law constant for solubility in water at 298.15 K (mol/(kg*bar))
d(ln(kH))/d(1/T) = Temperature dependence constant (K)
k°H (mol/(kg*bar)) | d(ln(kH))/d(1/T) (K) | Method | Reference | Comment |
---|---|---|---|---|
14. | 5600. | L | N/A | |
13. | 5700. | M | N/A | |
9.8 | Q | N/A | missing citation give several references for the Henry's law constants but don't assign them to specific species. | |
17. | 5000. | M | N/A | The data from Table 1 by missing citation was used to redo the regression analysis. The data for acetone in their Table 2 is wrong. |
11. | 6300. | M | N/A | missing citation list effective values that take into account hydration of the aldehydes: kH = ([RCHO] + [RCH(OH)2]) / p(RCHO) |
1.7 | 4500. | X | N/A | |
13. | 5800. | M | N/A | |
15. | X | N/A | Value given here as quoted by missing citation. | |
17. | 4700. | X | N/A | |
15. | M | Buttery, Ling, et al., 1969 | ||
15. | X | N/A | Value given here as quoted by missing citation. |

Gas phase ion energetics data

Data evaluated as indicated in comments:
HL - Edward P. Hunter and Sharon G. Lias
L - Sharon G. Lias
Data compiled as indicated in comments:
B - John E. Bartmess
LBLHLM - Sharon G. Lias, John E. Bartmess, Joel F. Liebman, John L. Holmes, Rhoda D. Levin, and W. Gary Mallard
LLK - Sharon G. Lias, Rhoda D. Levin, and Sherif A. Kafafi
RDSH - Henry M. Rosenstock, Keith Draxl, Bruce W. Steiner, and John T. Herron
Quantity | Value | Units | Method | Reference | Comment |
---|---|---|---|---|---|
IE (evaluated) | 10.229 ± 0.0007 | eV | N/A | N/A | L |
Quantity | Value | Units | Method | Reference | Comment |
Proton affinity (review) | 183.7 | kcal/mol | N/A | Hunter and Lias, 1998 | HL |
Quantity | Value | Units | Method | Reference | Comment |
Gas basicity | 176.0 | kcal/mol | N/A | Hunter and Lias, 1998 | HL |
Electron affinity determinations
EA (eV) | Method | Reference | Comment |
---|---|---|---|
0.00035 | EFD | Desfrancois, Abdoul-Carime, et al., 1994 | EA: 0.36 meV. Dipole-bound state.; B |
Ionization energy determinations
Appearance energy determinations
De-protonation reactions
C2H3O- + =
By formula: C2H3O- + H+ = C2H4O
Quantity | Value | Units | Method | Reference | Comment |
---|---|---|---|---|---|
ΔrH° | 366.42 ± 0.81 | kcal/mol | D-EA | Mead, Lykke, et al., 1984 | gas phase; Uncertainty: 6 millical/mol (0.26 micro-eV).Dipolebound state at ca. 14.3 cal/mol (5 cm-1); B |
ΔrH° | 365.8 ± 2.2 | kcal/mol | G+TS | Bartmess, Scott, et al., 1979 | gas phase; Acid: ethanal. The enol is 9.6 kcal/mol more acidic: Holmes and Lossing, 1982; value altered from reference due to change in acidity scale; B |
ΔrH° | 366.5 ± 2.9 | kcal/mol | G+TS | Cumming and Kebarle, 1978 | gas phase; B |
Quantity | Value | Units | Method | Reference | Comment |
ΔrG° | 359.6 ± 1.2 | kcal/mol | H-TS | Mead, Lykke, et al., 1984 | gas phase; Uncertainty: 6 millical/mol (0.26 micro-eV).Dipolebound state at ca. 14.3 cal/mol (5 cm-1); B |
ΔrG° | 359.0 ± 2.0 | kcal/mol | IMRE | Bartmess, Scott, et al., 1979 | gas phase; Acid: ethanal. The enol is 9.6 kcal/mol more acidic: Holmes and Lossing, 1982; value altered from reference due to change in acidity scale; B |
ΔrG° | 359.7 ± 2.0 | kcal/mol | IMRE | Cumming and Kebarle, 1978 | gas phase; B |
C2H3O- + =
By formula: C2H3O- + H+ = C2H4O
Quantity | Value | Units | Method | Reference | Comment |
---|---|---|---|---|---|
ΔrH° | 393.19 ± 0.96 | kcal/mol | D-EA | Nimlos, Soderquist, et al., 1989 | gas phase; B |
ΔrH° | 391.0 ± 2.1 | kcal/mol | G+TS | DePuy, Bierbaum, et al., 1985 | gas phase; B |
ΔrH° | 387.0 ± 8.0 | kcal/mol | CIDT | Graul and Squires, 1990 | gas phase; B |
ΔrH° | <382.00 | kcal/mol | CIDT | Graul and Squires, 1988 | gas phase; B |
Quantity | Value | Units | Method | Reference | Comment |
ΔrG° | 385.4 ± 1.1 | kcal/mol | H-TS | Nimlos, Soderquist, et al., 1989 | gas phase; B |
ΔrG° | 383.3 ± 2.0 | kcal/mol | IMRB | DePuy, Bierbaum, et al., 1985 | gas phase; B |
ΔrG° | <374.25 ± 0.60 | kcal/mol | H-TS | Graul and Squires, 1988 | gas phase; B |

Ion clustering data

Data compiled as indicated in comments:
RCD - Robert C. Dunbar
B - John E. Bartmess
M - Michael M. Meot-Ner (Mautner) and Sharon G. Lias
Clustering reactions
By formula: Ag+ + C2H4O = (Ag+ • C2H4O)
Quantity | Value | Units | Method | Reference | Comment |
---|---|---|---|---|---|
ΔrH° | 43.5 ± 4.5 | kcal/mol | RAK | Ho, Yang, et al., 1997 | RCD |
By formula: C2H3O2- + C2H4O = (C2H3O2- • C2H4O)
Bond type: Hydrogen bonds of deprotonated acids to ketones/
Quantity | Value | Units | Method | Reference | Comment |
---|---|---|---|---|---|
ΔrH° | 16.3 ± 1.0 | kcal/mol | TDAs | Meot-ner, 1988 | gas phase; B,M |
Quantity | Value | Units | Method | Reference | Comment |
ΔrS° | 21.7 | cal/mol*K | PHPMS | Meot-ner, 1988 | gas phase; M |
Quantity | Value | Units | Method | Reference | Comment |
ΔrG° | 9.8 ± 2.0 | kcal/mol | TDAs | Meot-ner, 1988 | gas phase; B |
By formula: C2H5O+ + C2H4O = (C2H5O+ • C2H4O)
Bond type: Hydrogen bonds of the type OH-O between organics
Quantity | Value | Units | Method | Reference | Comment |
---|---|---|---|---|---|
ΔrH° | 31.9 | kcal/mol | ICR | Larson and McMahon, 1982 | gas phase; switching reaction((CH3)2OH+)(CH3)2O, Entropy change calculated or estimated; Grimsrud and Kebarle, 1973, Lias, Liebman, et al., 1984; M |
Quantity | Value | Units | Method | Reference | Comment |
ΔrS° | 29.0 | cal/mol*K | N/A | Larson and McMahon, 1982 | gas phase; switching reaction((CH3)2OH+)(CH3)2O, Entropy change calculated or estimated; Grimsrud and Kebarle, 1973, Lias, Liebman, et al., 1984; M |
Quantity | Value | Units | Method | Reference | Comment |
ΔrG° | 23.3 | kcal/mol | ICR | Larson and McMahon, 1982 | gas phase; switching reaction((CH3)2OH+)(CH3)2O, Entropy change calculated or estimated; Grimsrud and Kebarle, 1973, Lias, Liebman, et al., 1984; M |
By formula: C2H5O+ + C2H4O = (C2H5O+ • C2H4O)
Bond type: Hydrogen bonds of the type OH-O between organics
Quantity | Value | Units | Method | Reference | Comment |
---|---|---|---|---|---|
ΔrH° | 29.0 | kcal/mol | ICR | Larson and McMahon, 1982 | gas phase; switching reaction((CH3)2OH+)(CH3)2O, Entropy change calculated or estimated; Grimsrud and Kebarle, 1973, Lias, Liebman, et al., 1984, Keesee and Castleman, 1986; M |
Quantity | Value | Units | Method | Reference | Comment |
ΔrS° | 26.2 | cal/mol*K | N/A | Larson and McMahon, 1982 | gas phase; switching reaction((CH3)2OH+)(CH3)2O, Entropy change calculated or estimated; Grimsrud and Kebarle, 1973, Lias, Liebman, et al., 1984, Keesee and Castleman, 1986; M |
Quantity | Value | Units | Method | Reference | Comment |
ΔrG° | 21.2 | kcal/mol | ICR | Larson and McMahon, 1982 | gas phase; switching reaction((CH3)2OH+)(CH3)2O, Entropy change calculated or estimated; Grimsrud and Kebarle, 1973, Lias, Liebman, et al., 1984, Keesee and Castleman, 1986; M |
(C2H5O- • 4294967295) +
= C2H5O-
By formula: (C2H5O- • 4294967295C2H4O) + C2H4O = C2H5O-
Quantity | Value | Units | Method | Reference | Comment |
---|---|---|---|---|---|
ΔrH° | 37.7 ± 1.0 | kcal/mol | N/A | Ramond, Davico, et al., 2000 | gas phase; B |
ΔrH° | 39.5 ± 2.2 | kcal/mol | Ther | Bartmess, Scott, et al., 1979 | gas phase; value altered from reference due to change in acidity scale; B |
By formula: C2H7O+ + C2H4O = (C2H7O+ • C2H4O)
Bond type: Hydrogen bonds of the type OH-O between organics
Quantity | Value | Units | Method | Reference | Comment |
---|---|---|---|---|---|
ΔrH° | 31.2 | kcal/mol | ICR | Larson and McMahon, 1982 | gas phase; switching reaction((CH3)2OH+)(CH3)2O, Entropy change calculated or estimated; Grimsrud and Kebarle, 1973, Lias, Liebman, et al., 1984, Keesee and Castleman, 1986; M |
Quantity | Value | Units | Method | Reference | Comment |
ΔrS° | 26.9 | cal/mol*K | N/A | Larson and McMahon, 1982 | gas phase; switching reaction((CH3)2OH+)(CH3)2O, Entropy change calculated or estimated; Grimsrud and Kebarle, 1973, Lias, Liebman, et al., 1984, Keesee and Castleman, 1986; M |
Quantity | Value | Units | Method | Reference | Comment |
ΔrG° | 23.2 | kcal/mol | ICR | Larson and McMahon, 1982 | gas phase; switching reaction((CH3)2OH+)(CH3)2O, Entropy change calculated or estimated; Grimsrud and Kebarle, 1973, Lias, Liebman, et al., 1984, Keesee and Castleman, 1986; M |
By formula: Cl- + C2H4O = (Cl- • C2H4O)
Quantity | Value | Units | Method | Reference | Comment |
---|---|---|---|---|---|
ΔrH° | 14.4 ± 2.0 | kcal/mol | IMRE | Larson and McMahon, 1984 | gas phase; B,M |
Quantity | Value | Units | Method | Reference | Comment |
ΔrS° | 21.7 | cal/mol*K | N/A | Larson and McMahon, 1984 | gas phase; switching reaction(Cl-)t-C4H9F, Entropy change calculated or estimated; Larson and McMahon, 1984, 2; M |
Quantity | Value | Units | Method | Reference | Comment |
ΔrG° | 7.9 ± 2.0 | kcal/mol | IMRE | Larson and McMahon, 1984 | gas phase; B,M |
By formula: Li+ + C2H4O = (Li+ • C2H4O)
Quantity | Value | Units | Method | Reference | Comment |
---|---|---|---|---|---|
ΔrH° | 41.3 | kcal/mol | ICR | Staley and Beauchamp, 1975 | gas phase; switching reaction(Li+)H2O, Keesee and Castleman, 1986 from Berman and Beauchamp, 1986; Dzidic and Kebarle, 1970 interpolated; M |
By formula: Mg+ + C2H4O = (Mg+ • C2H4O)
Quantity | Value | Units | Method | Reference | Comment |
---|---|---|---|---|---|
ΔrH° | 63. ± 5. | kcal/mol | ICR | Operti, Tews, et al., 1988 | gas phase; switching reaction,Thermochemical ladder(Mg+)CH3OH; M |
By formula: NO- + C2H4O = (NO- • C2H4O)
Quantity | Value | Units | Method | Reference | Comment |
---|---|---|---|---|---|
ΔrH° | 39.1 | kcal/mol | ICR | Reents and Freiser, 1981 | gas phase; switching reaction,Thermochemical ladder(NO+)C2H5OH, Entropy change calculated or estimated; Farid and McMahon, 1978; M |
By formula: Na+ + C2H4O = (Na+ • C2H4O)
Quantity | Value | Units | Method | Reference | Comment |
---|---|---|---|---|---|
ΔrH° | 27.1 ± 0.8 | kcal/mol | CIDT | Armentrout and Rodgers, 2000 | RCD |

Kovats' RI, non-polar column, isothermal

Data compiled by: NIST Mass Spectrometry Data Center, William E. Wallace, director

Column type CapillaryCapillaryCapillaryCapillaryCapillary
Active phase HP-1HP-1HP-1HP-1HP-1
Column length (m) 50.50.50.50.50.
Carrier gas
Substrate
Column diameter (mm) 0.320.320.320.320.32
Phase thickness (μm) 1.051.051.051.051.05
Temperature (C) 110.20.30.40.50.
I 360.88364.0362.6361.6360.37
ReferenceHéberger, Görgényi, et al., 2002Héberger, Görgényi, et al., 2002Héberger, Görgényi, et al., 2002Héberger, Görgényi, et al., 2002Héberger, Görgényi, et al., 2002
Comment MSDC-RI MSDC-RI MSDC-RI MSDC-RI MSDC-RI
Column type CapillaryCapillaryCapillaryCapillaryCapillary
Active phase HP-1HP-1HP-1HP-1HP-1
Column length (m) 50.50.50.50.50.
Carrier gas    N2N2
Substrate
Column diameter (mm) 0.320.320.320.320.32
Phase thickness (μm) 1.051.051.051.051.05
Temperature (C) 60.70.90.110.50.
I 360.5360.64360.37361.360.
ReferenceHéberger, Görgényi, et al., 2002Héberger, Görgényi, et al., 2002Héberger, Görgényi, et al., 2002Héberger and Görgényi, 1999Héberger and Görgényi, 1999
Comment MSDC-RI MSDC-RI MSDC-RI MSDC-RI MSDC-RI
Column type CapillaryCapillaryCapillaryPackedPacked
Active phase HP-1HP-1OV-3SE-30SE-30
Column length (m) 50.50.150.2.3.7
Carrier gas N2N2
Substrate    Gaschrom QCelatom AW silanized
Column diameter (mm) 0.320.320.64
Phase thickness (μm) 1.051.05
Temperature (C) 70.90.170.100.150.
I 361.360.410.369.367.
ReferenceHéberger and Görgényi, 1999Héberger and Görgényi, 1999Buttery, Ling, et al., 1983Winskowski, 1983Haken, Nguyen, et al., 1979
Comment MSDC-RI MSDC-RI MSDC-RI MSDC-RI MSDC-RI
Column type PackedPacked
Active phase SqualaneApiezon L
Column length (m)
Carrier gas
Substrate Chromosorb GCelite (40:60 Gewichtsverhaltnis)
Column diameter (mm)
Phase thickness (μm)
Temperature (C) 50.70.
I 346.343.
ReferenceMira and Sanchez, 1970von Kováts, 1958
Comment MSDC-RI MSDC-RI

Kovats' RI, polar column, temperature ramp

Data compiled by: NIST Mass Spectrometry Data Center, William E. Wallace, director

Column type CapillaryCapillaryCapillaryPackedCapillary
Active phase DB-WaxCarbowax 20MDB-WaxPEG-20MCarbowax 20M
Column length (m) 60.50.30.5.550.
Carrier gas He N2N2N2
Substrate    Celite
Column diameter (mm) 0.250.220.25 0.28
Phase thickness (μm)
Tstart (C) 40.80.60.70.80.
Tend (C) 200.200.200.175.200.
Heat rate (K/min) 2.2.2.10.2.
Initial hold (min) 2. 10.9.
Final hold (min)
I 714.690.744.690.689.
ReferenceUmano, Hagi, et al., 1994Nishimura, Yamaguchi, et al., 1989Umano, Shoji, et al., 1986Galt and MacLeod, 1984Shibamoto, Kamiya, et al., 1981
Comment MSDC-RI MSDC-RI MSDC-RI MSDC-RI MSDC-RI
Column type CapillaryCapillaryCapillary
Active phase Carbowax 20MCarbowax 20MCarbowax 20M
Column length (m) 50.70.70.
Carrier gas N2N2N2
Substrate
Column diameter (mm) 0.280.280.28
Phase thickness (μm)
Tstart (C) 80.80.80.
Tend (C) 200.200.200.
Heat rate (K/min) 2.2.2.
Initial hold (min)
Final hold (min)
I 690.690.692.
ReferenceShibamoto, Kamiya, et al., 1981Yamaguchi and Shibamoto, 1981Yamaguchi and Shibamoto, 1981
Comment MSDC-RI MSDC-RI MSDC-RI

Normal alkane RI, non-polar column, isothermal

Data compiled by: NIST Mass Spectrometry Data Center, William E. Wallace, director

Column type CapillaryPackedPacked
Active phase OV-1SynachromSynachrom
Column length (m)  1.51.5
Carrier gas  HeliumHelium
Substrate  Synachrom (60-80 mesh)Synachrom (60-80 mesh)
Column diameter (mm)
Phase thickness (μm)
Temperature (C) 60.150.150.
I 360.356.365.
ReferenceAmboni, Junkes, et al., 2002Dufka, Malinsky, et al., 1971Dufka, Malinsky, et al., 1971
Comment MSDC-RI MSDC-RI MSDC-RI

Normal alkane RI, polar column, isothermal

Data compiled by: NIST Mass Spectrometry Data Center, William E. Wallace, director

Column type Packed
Active phase Carbowax 20M
Column length (m)
Carrier gas
Substrate
Column diameter (mm)
Phase thickness (μm)
Temperature (C) 100.
I 695.
ReferenceYabumoto, Jennings, et al., 1977
Comment MSDC-RI

Normal alkane RI, polar column, temperature ramp

Data compiled by: NIST Mass Spectrometry Data Center, William E. Wallace, director

Column type CapillaryCapillaryCapillaryCapillaryCapillary
Active phase HP-InnowaxZB-WaxDB-WaxDB-WaxDB-Wax
Column length (m) 60.60.30.30.60.
Carrier gas HeliumHeliumHeN2
Substrate
Column diameter (mm) 0.250.320.250.320.53
Phase thickness (μm) 0.250.500.250.251.
Tstart (C) 60.40.40.40.50.
Tend (C) 220.220.230.230.180.
Heat rate (K/min) 3.4.4.4.3.
Initial hold (min) 1.5.2.2.10.
Final hold (min) 5.5.5.5.
I 714.712.713.713.690.
ReferenceFeng, Zhuang, et al., 2011Marin, Pozrl, et al., 2008Xu, Fan, et al., 2007Fan and Qian, 2005Rizzolo, Cambiaghi, et al., 2005
Comment MSDC-RI MSDC-RI MSDC-RI MSDC-RI MSDC-RI
Column type CapillaryCapillaryCapillaryCapillaryCapillary
Active phase Supelcowax-10Supelcowax-10DB-WaxTC-WaxDB-Wax
Column length (m) 60.60.60.60.30.
Carrier gas HeHe HeHe
Substrate
Column diameter (mm) 0.530.530.250.250.25
Phase thickness (μm) 1.1.0.50.50.25
Tstart (C) 40.40.35.40.40.
Tend (C) 240.240.240.230.250.
Heat rate (K/min) 4.4.4.3.8.
Initial hold (min) 2.2.5.8.5.
Final hold (min) 20.20.10. 5.
I 712.728.703.718.677.
ReferenceRochat and Chaintreau, 2005Rochat and Chaintreau, 2005Chida, Sone, et al., 2004Ishikawa, Ito, et al., 2004Fu, Yoon, et al., 2002
Comment MSDC-RI MSDC-RI MSDC-RI MSDC-RI MSDC-RI
Column type CapillaryCapillaryCapillaryCapillaryCapillary
Active phase Supelcowax-10DB-WaxDB-WaxDB-WaxDB-Wax
Column length (m) 60.30.60.60.60.
Carrier gas HeH2NitrogenHeHe
Substrate
Column diameter (mm) 0.250.320.250.320.25
Phase thickness (μm) 0.250.5 0.250.25
Tstart (C) 35.60.40.34.40.
Tend (C) 200.245.200.200.200.
Heat rate (K/min) 4.3.2.5.2.
Initial hold (min) 10.3.10.3.2.
Final hold (min)  20. 10.
I 700.750.701.704.690.
ReferenceGirard and Durance, 2000Kotseridis and Baumes, 2000Tamura, Boonbumrung, et al., 2000Schlüter, Steinhart, et al., 1999Umano, Nakahara, et al., 1999
Comment MSDC-RI MSDC-RI MSDC-RI MSDC-RI MSDC-RI
Column type CapillaryCapillaryCapillary
Active phase Supelcowax-10DB-WaxFFAP
Column length (m) 60.60.50.
Carrier gas H2HeHe
Substrate
Column diameter (mm) 0.320.250.28
Phase thickness (μm) 0.5
Tstart (C) 35.40.60.
Tend (C) 250.200.240.
Heat rate (K/min) 5.2.2.
Initial hold (min) 5.2.5.
Final hold (min) 20.
I 703.714.680.
ReferenceCampeanu, Burcea, et al., 1998Umano, Hagi, et al., 1995Vernin, Metzger, et al., 1988
Comment MSDC-RI MSDC-RI MSDC-RI

Kovats' RI, non-polar column, temperature ramp

Data compiled by: NIST Mass Spectrometry Data Center, William E. Wallace, director

Column type CapillaryCapillaryCapillaryCapillaryCapillary
Active phase BP-1BP-1OV-101OV-101OV-101
Column length (m) 50.50.25.50.80.
Carrier gas HeHeHe N2
Substrate
Column diameter (mm) 0.23 0.310.230.28
Phase thickness (μm)
Tstart (C) 30.-100.60.80.80.
Tend (C) 200.200.200.200.200.
Heat rate (K/min) 2.2.2.2.1.
Initial hold (min) 2.
Final hold (min)
I 363.380.363.389.363.
ReferenceBartley and Schwede, 1989Bartley, 1988Morales and Duque, 1987Ohnishi and Shibamoto, 1984Shibamoto, Kamiya, et al., 1981
Comment MSDC-RI MSDC-RI MSDC-RI MSDC-RI MSDC-RI
Column type CapillaryCapillaryCapillary
Active phase OV-101OV-101OV-101
Column length (m) 80.70.70.
Carrier gas N2N2N2
Substrate
Column diameter (mm) 0.280.280.28
Phase thickness (μm)
Tstart (C) 80.80.80.
Tend (C) 200.200.200.
Heat rate (K/min) 1.2.2.
Initial hold (min)
Final hold (min)
I 363.358.363.
ReferenceShibamoto, Kamiya, et al., 1981Yamaguchi and Shibamoto, 1981Yamaguchi and Shibamoto, 1981
Comment MSDC-RI MSDC-RI MSDC-RI

References

Wiberg, Crocker, et al., 1991
Wiberg, K.B.; Crocker, L.S.; Morgan, K.M.,
Thermochemical studies of carbonyl compounds. 5. Enthalpies of reduction of carbonyl groups,
J. Am. Chem. Soc., 1991, 113, 3447-3450. [all data]
Thermodynamics Research Center, 1997
Thermodynamics Research Center,
Selected Values of Properties of Chemical Compounds., Thermodynamics Research Center, Texas A&M University, College Station, Texas, 1997. [all data]
Pitzer K.S., 1949
Pitzer K.S., Jr.,
Thermodynamics and vibrational spectrum of acetaldehyde,
J. Am. Chem. Soc., 1949, 71, 2842-2844. [all data]
Della Vedova C.O., 1991
Della Vedova C.O.,
Raman and infrared spectra and photochemical behavior of acetaldehyde isolated in matrixes,
J. Raman Spectrosc., 1991, 22, 505-507. [all data]
East A.L.L., 1997
East A.L.L.,
Ab initio statistical thermodynamical models for the computation of third-law entropies,
J. Chem. Phys., 1997, 106, 6655-6674. [all data]
Chao J., 1980
Chao J.,
Perfect gas thermodynamic properties of methanal, ethanal and their deuterated species,
Thermochim. Acta, 1980, 41, 41-54. [all data]
Chao J., 1986
Chao J.,
Thermodynamic properties of key organic oxygen compounds in the carbon range C1 to C4. Part 2. Ideal gas properties,
J. Phys. Chem. Ref. Data, 1986, 15, 1369-1436. [all data]
Coleman C.F., 1949
Coleman C.F.,
The heat capacity of organic vapors. V. Acetaldehyde,
J. Am. Chem. Soc., 1949, 71, 2839-2841. [all data]
Lebedev and Vasil'ev, 1988
Lebedev, B.V.; Vasil'ev, V.G.,
Thermodynamics of ethanal at 0-300 K,
Zhur. Fiz. Khim., 1988, 62, 3099-3102. [all data]
Connor, Elving, et al., 1947
Connor, A.Z.; Elving, P.J.; Steingiser, S.,
Specific heat of acetaldehyde and acetaldehyde dibutyl acetal,
J. Am. Chem. Soc., 1947, 69, 1532. [all data]
Teja and Anselme, 1990
Teja, A.S.; Anselme, M.J.,
The critical properties of thermally stable and unstable fluids. I. 1985 results,
AIChE Symp. Ser., 1990, 86, 279, 115-21. [all data]
Hollmann, 1903
Hollmann, R.,
Physical and natural equilibria between the modifications of aldehyde,
Z. Phys. Chem., Stoechiom. Verwandtschaftsl., 1903, 43, 129-59. [all data]
Van der Waals, 1881
Van der Waals, J.D.,
Continuity of Gas and Liquid Data, 1881,, 1881, Leipzig, p 168. [all data]
Majer and Svoboda, 1985
Majer, V.; Svoboda, V.,
Enthalpies of Vaporization of Organic Compounds: A Critical Review and Data Compilation, Blackwell Scientific Publications, Oxford, 1985, 300. [all data]
Bull, Seregrennaja, et al., 1963
Bull, S.S.; Seregrennaja, I.I.; Tsherbakora, P.R.,
Khim. Prom. (Moscow), 1963, 7, 507. [all data]
Verevkin, Krasnykh, et al., 2003
Verevkin, Sergey P.; Krasnykh, Eugen L.; Vasiltsova, Tatiana V.; Koutek, Bohumir; Doubsky, Jan; Heintz, Andreas,
Vapor pressures and enthalpies of vaporization of a series of the linear aliphatic aldehydes,
Fluid Phase Equilibria, 2003, 206, 1-2, 331-339, https://doi.org/10.1016/S0378-3812(03)00035-9
. [all data]
Stephenson and Malanowski, 1987
Stephenson, Richard M.; Malanowski, Stanislaw,
Handbook of the Thermodynamics of Organic Compounds, 1987, https://doi.org/10.1007/978-94-009-3173-2
. [all data]
Dykyj, 1970
Dykyj, J.,
Petrochemica, 1970, 10, 2, 51. [all data]
Kim and Kim, 1977
Kim, B.C.; Kim, D.H.,
Hwahak Kwa Hwahak Kongop, 1977, 20, 232. [all data]
Coles and Popper, 1950
Coles, K.F.; Popper, Felix,
Vapor-Liquid Equilibria. Ethylene Oxide - Acetaldehyde and Ethylene Oxide - Water Systems,
Ind. Eng. Chem., 1950, 42, 7, 1434-1438, https://doi.org/10.1021/ie50487a046
. [all data]
Coleman and DeVries, 1949
Coleman, C.F.; DeVries, T.,
The heat capacity of organic vapors. V. Acetaldehyde,
J. Am. Chem. Soc., 1949, 71, 2839-28. [all data]
Bull, Seregrennaja, et al., 1963, 2
Bull, S.Sh.; Seregrennaja, I.I.; Tsherbakora, P.R.,
Isothermic Equilibrium of Liquid-Steam in System Water-Acetoaldehyde,
Khim. Prom. (Moscow), 1963, 7, 507-509. [all data]
Domalski and Hearing, 1996
Domalski, Eugene S.; Hearing, Elizabeth D.,
Heat Capacities and Entropies of Organic Compounds in the Condensed Phase. Volume III,
J. Phys. Chem. Ref. Data, 1996, 25, 1, 1, https://doi.org/10.1063/1.555985
. [all data]
Mead, Lykke, et al., 1984
Mead, R.D.; Lykke, K.R.; Lineberger, W.C.; Marks, J.; Brauman, J.I.,
Spectroscopy and Dynamics of the Dipole-Bound State of Acetaldehyde Enolate.,
J. Chem. Phys., 1984, 81, 11, 4883., https://doi.org/10.1063/1.447515
. [all data]
Bartmess, Scott, et al., 1979
Bartmess, J.E.; Scott, J.A.; McIver, R.T., Jr.,
The gas phase acidity scale from methanol to phenol,
J. Am. Chem. Soc., 1979, 101, 6047. [all data]
Holmes and Lossing, 1982
Holmes, J.L.; Lossing, F.P.,
Heats of formation of the ionic and neutral enols of acetaldehyde and acetone,
J. Am. Chem. Soc., 1982, 104, 2648. [all data]
Cumming and Kebarle, 1978
Cumming, J.B.; Kebarle, P.,
Summary of gas phase measurements involving acids AH. Entropy changes in proton transfer reactions involving negative ions. Bond dissociation energies D(A-H) and electron affinities EA(A),
Can. J. Chem., 1978, 56, 1. [all data]
Larson and McMahon, 1982
Larson, J.W.; McMahon, T.B.,
Formation, Thermochemistry, and Relative Stabilities of Proton - Bound dimers of Oxygen n - Donor Bases from Ion Cyclotron Resonance Solvent - Exchange Equilibria Measurements,
J. Am. Chem. Soc., 1982, 104, 23, 6255, https://doi.org/10.1021/ja00387a016
. [all data]
Grimsrud and Kebarle, 1973
Grimsrud, E.P.; Kebarle, P.,
Gas Phase Ion Equilibria Studies of the Solvation of the Hydrogen Ion by Methanol, Dimethyl Ether and Water. Effect of Hydrogen Bonding,
J. Am. Chem. Soc., 1973, 95, 24, 7939, https://doi.org/10.1021/ja00805a002
. [all data]
Lias, Liebman, et al., 1984
Lias, S.G.; Liebman, J.F.; Levin, R.D.,
Evaluated gas phase basicities and proton affinities of molecules heats of formation of protonated molecules,
J. Phys. Chem. Ref. Data, 1984, 13, 695. [all data]
Keesee and Castleman, 1986
Keesee, R.G.; Castleman, A.W., Jr.,
Thermochemical data on Ggs-phase ion-molecule association and clustering reactions,
J. Phys. Chem. Ref. Data, 1986, 15, 1011. [all data]
Nimlos, Soderquist, et al., 1989
Nimlos, M.R.; Soderquist, J.A.; Ellison, G.B.,
Spectroscopy of CH3CO- and CH3CO,
J. Am. Chem. Soc., 1989, 111, 20, 7675, https://doi.org/10.1021/ja00202a001
. [all data]
DePuy, Bierbaum, et al., 1985
DePuy, C.H.; Bierbaum, V.M.; Damrauer, R.; Soderquist, J.A.,
Gas-phase reactions of the acetyl anion,
J. Am. Chem. Soc., 1985, 107, 3385. [all data]
Graul and Squires, 1990
Graul, S.T.; Squires, R.R.,
Gas-Phase Acidities Derived from Threshold Energies for Activated Reactions,
J. Am. Chem. Soc., 1990, 112, 7, 2517, https://doi.org/10.1021/ja00163a007
. [all data]
Graul and Squires, 1988
Graul, S.T.; Squires, R.R.,
On the Existence of Alkyl Carbanions in the Gas Phase,
J. Am. Chem. Soc., 1988, 110, 2, 607, https://doi.org/10.1021/ja00210a054
. [all data]
Larson and McMahon, 1984
Larson, J.W.; McMahon, T.B.,
Hydrogen bonding in gas phase anions. An experimental investigation of the interaction between chloride ion and bronsted acids from ICR chloride exchange equilibria,
J. Am. Chem. Soc., 1984, 106, 517. [all data]
Larson and McMahon, 1984, 2
Larson, J.W.; McMahon, T.B.,
Gas phase negative ion chemistry of alkylchloroformates,
Can. J. Chem., 1984, 62, 675. [all data]
Meot-ner, 1988
Meot-ner, M.,
Ionic Hydrogen Bond and Ion Solvation. 6. Interaction Energies of the Acetate Ion with Organic Molecules. Comparison of CH3COO- with Cl-, CN-, and SH-,
J. Am. Chem. Soc., 1988, 110, 12, 3854, https://doi.org/10.1021/ja00220a022
. [all data]
Dolliver, Gresham, et al., 1938
Dolliver, M.A.; Gresham, T.L.; Kistiakowsky, G.B.; Smith, E.A.; Vaughan, W.E.,
Heats of organic reactions. VI. Heats of hydrogenation of some oxygen-containing compounds,
J. Am. Chem. Soc., 1938, 60, 440-450. [all data]
Cox and Pilcher, 1970
Cox, J.D.; Pilcher, G.,
Thermochemistry of Organic and Organometallic Compounds, Academic Press, New York, 1970, 1-636. [all data]
Ramond, Davico, et al., 2000
Ramond, T.M.; Davico, G.E.; Schwartz, R.L.; Lineberger, W.C.,
Vibronic structure of alkoxy radicals via photoelectron spectroscopy,
J. Chem. Phys., 2000, 112, 3, 1158-1169, https://doi.org/10.1063/1.480767
. [all data]
Reents and Freiser, 1981
Reents, W.D.; Freiser, B.S.,
Gas-Phase Binding Energies and Spectroscopic Properties of NO+ Charge-Transfer Complexes,
J. Am. Chem. Soc., 1981, 103, 2791. [all data]
Farid and McMahon, 1978
Farid, R.; McMahon, T.B.,
Gas-Phase Ion-Molecule Reactions of Alkyl Nitrites by Ion Cyclotron Resonance Spectroscopy,
Int. J. Mass Spectrom. Ion Phys., 1978, 27, 2, 163, https://doi.org/10.1016/0020-7381(78)80037-0
. [all data]
Staley and Beauchamp, 1975
Staley, R.H.; Beauchamp, J.L.,
Intrinsic Acid - Base Properties of Molecules. Binding Energies of Li+ to pi - and n - Donor Bases,
J. Am. Chem. Soc., 1975, 97, 20, 5920, https://doi.org/10.1021/ja00853a050
. [all data]
Berman and Beauchamp, 1986
Berman, D.W.; Beauchamp, J.L.,
Quoted in Keesee and Castleman, 1986, 1986. [all data]
Dzidic and Kebarle, 1970
Dzidic, I.; Kebarle, P.,
Hydration of the Alkali Ions in the Gas Phase. Enthalpies and Entropies of Reactions M+(H2O)n-1 + H2O = M+(H2O)n,
J. Phys. Chem., 1970, 74, 7, 1466, https://doi.org/10.1021/j100702a013
. [all data]
Krasnov, Ozherel'eva, et al., 1983
Krasnov, V.L.; Ozherel'eva, N.K.; Trub, E.P.; Tsvetkov, V.G.; Bodrikov, I.V.,
Trimerization of aldehydes under the action of sulfur dioxide,
J. Gen. Chem. USSR, 1983, 53, 2135-2138. [all data]
Busfield, Lee, et al., 1973
Busfield, W.K.; Lee, R.M.; Merifold, D.,
Gas phase equilibrium between acetaldehyde and paraldehyde, thermodynamic values for the trimerisation of acetaldehyde and the polymerisability of paraldehyde,
J. Chem. Soc. Faraday Trans. 1, 1973, 69, 936-940. [all data]
Operti, Tews, et al., 1988
Operti, L.; Tews, E.C.; Freiser, B.S.,
Determination of Gas-Phase Ligand Binding Energies to Mg+ by FTMS Techniques,
J. Am. Chem. Soc., 1988, 110, 12, 3847, https://doi.org/10.1021/ja00220a020
. [all data]
Wiberg, 1980
Wiberg, K.B.,
Energies of organic compounds,
Rept. DOE-E(11-1)4060 Prepared for US Dept. of Energy by Yale Univ., New Haven, CT. Avail. NTIS, 1980, 1-24. [all data]
Birley and Skinner, 1970
Birley, G.I.; Skinner, H.A.,
Enthalpies of hydrolysis of dimethoxymethane and 1,1-dimethoxyethane,
Trans. Faraday Soc., 1970, 66, 791-793. [all data]
Wiberg, Morgan, et al., 1994
Wiberg, K.B.; Morgan, K.M.; Maltz, H.,
Thermochemistry of carbonyl reactions. 6. A study of hydration equilibria,
J. Am. Chem. Soc., 1994, 116, 11067-11077. [all data]
Walsh and Benson, 1966
Walsh, R.; Benson, S.W.,
The heats of formation of acetyl iodide and the acetyl radical,
J. Phys. Chem., 1966, 70, 3751-3753. [all data]
Landrieu, 1905
Landrieu, M.Ph.,
Thermochimie. - Thermochimie des hydrazones,
Compt. Rend., 1905, 141, 358-361. [all data]
Armentrout and Rodgers, 2000
Armentrout, P.B.; Rodgers, M.T.,
An Absolute Sodium Cation Affinity Scale: Threshold Collision-Induced Dissociation Experiments and ab Initio Theory,
J. Phys. Chem A, 2000, 104, 11, 2238, https://doi.org/10.1021/jp991716n
. [all data]
Ho, Yang, et al., 1997
Ho, Y.-P.; Yang, Y.-C.; Klippenstein, S.J.; Dunbar, R.C.,
Binding Energies of Ag+ and Cd+ Complexes from Analysis of Radiative Association Kinetics,
J. Phys. Chem. A, 1997, 101, 18, 3338, https://doi.org/10.1021/jp9637284
. [all data]
Buttery, Ling, et al., 1969
Buttery, R.G.; Ling, L.C.; Guadagni, D.G.,
Volatilities Aldehydes, Ketones, and Esters in Dilute Water Solution,
J. Agric. Food Chem., 1969, 17, 385-389. [all data]
Hunter and Lias, 1998
Hunter, E.P.; Lias, S.G.,
Evaluated Gas Phase Basicities and Proton Affinities of Molecules: An Update,
J. Phys. Chem. Ref. Data, 1998, 27, 3, 413-656, https://doi.org/10.1063/1.556018
. [all data]
Desfrancois, Abdoul-Carime, et al., 1994
Desfrancois, C.; Abdoul-Carime, H.; Khelifa, N.; Schermann, J.P.,
Fork 1/r to 1/r2 Potentials: Electron Exchange between Rydberg Atoms and Polar Molecules,
Phys. Rev. Lett., 1994, 73, 18, 2436, https://doi.org/10.1103/PhysRevLett.73.2436
. [all data]
Traeger, 1985
Traeger, J.C.,
Heat of formation for the formyl cation by photoionization mass spectrometry,
Int. J. Mass Spectrom. Ion Processes, 1985, 66, 271. [all data]
Traeger, McLouglin, et al., 1982
Traeger, J.C.; McLouglin, R.G.; Nicholson, A.J.C.,
Heat of formation for acetyl cation in the gas phase,
J. Am. Chem. Soc., 1982, 104, 5318. [all data]
El-Sherbini, Allam, et al., 1981
El-Sherbini, T.M.; Allam, S.H.; Migahed, M.D.; Dawoud, A.M.,
Mass spectrometric investigation of aliphatic aldehydes,
Z. Naturforsch. A:, 1981, 36, 1334. [all data]
Jochims, Lohr, et al., 1978
Jochims, H.-W.; Lohr, W.; Baumgartel, H.,
Photoionization mass spectrometry studies of deuterated acetaldehydes CH3CDO and CD3CHO,
Chem. Phys. Lett., 1978, 54, 594. [all data]
Staley, Wieting, et al., 1977
Staley, R.H.; Wieting, R.D.; Beauchamp, J.L.,
Carbenium ion stabilities in the gas phase and solution. An ion cyclotron resonance study of bromide transfer reactions involving alkali ions, alkyl carbenium ions, acyl cations and cyclic halonium ions,
J. Am. Chem. Soc., 1977, 99, 5964. [all data]
Hernandez, Masclet, et al., 1977
Hernandez, R.; Masclet, P.; Mouvier, G.,
Spectroscopie de photoelectrons d'aldehydes et de cetones aliphatiques,
J. Electron Spectrosc. Relat. Phenom., 1977, 10, 333. [all data]
Holmes, Terlouw, et al., 1976
Holmes, J.L.; Terlouw, J.K.; Lossing, F.P.,
The thermochemistry of C2H4O+ ions,
J. Phys. Chem., 1976, 80, 2860. [all data]
Meeks, Arnett, et al., 1975
Meeks, J.L.; Arnett, J.F.; Larson, D.; McGlynn, S.P.,
Photoelectron spectroscopy of carbonyls. Ionization assignments,
Chem. Phys. Lett., 1975, 30, 190. [all data]
McGlynn and Meeks, 1975
McGlynn, S.P.; Meeks, J.L.,
Photoelectron spectra of carbonyls: Acetaldehyde, acetamide, biacetyl, pyruvic acid, methyl pyruvate and vamide,
J. Electron Spectrosc. Relat. Phenom., 1975, 6, 269. [all data]
Warneck, 1974
Warneck, P.,
Heat of formation of the HCO radical,
Z. Naturforsch. A:, 1974, 29, 350. [all data]
Tam, Yee, et al., 1974
Tam, W.-C.; Yee, D.; Brion, C.E.,
Photoelectron spectra of some aldehydes and ketones,
J. Electron Spectrosc. Relat. Phenom., 1974, 4, 77. [all data]
Ogata, Kitayama, et al., 1974
Ogata, H.; Kitayama, J.; Koto, M.; Kojima, S.; Nihei, Y.; Kamada, H.,
Vacuum ultraviolet absorption and photoelectron spectra of aliphatic ketones,
Bull. Chem. Soc. Jpn., 1974, 47, 958. [all data]
Krassig, Reinke, et al., 1974
Krassig, R.; Reinke, D.; Baumgartel, H.,
Photo-reaktionen kleiner organischer molekule II. Die photoionenspektren der Isomeren propylen-cyclopropan und acetaldehyd-athylenoxyd,
Ber. Bunsen-Ges. Phys. Chem., 1974, 78, 425. [all data]
Knowles and Nicholson, 1974
Knowles, D.J.; Nicholson, A.J.C.,
Ionization energies of formic and acetic acid monomers,
J. Chem. Phys., 1974, 60, 1180. [all data]
Chadwick and Katrib, 1974
Chadwick, D.; Katrib, A.,
Photoelectron spectra of acetaldehyde and acetyl halides,
J. Electron Spectrosc. Relat. Phenom., 1974, 3, 39. [all data]
Potapov and Sorokin, 1972
Potapov, V.K.; Sorokin, V.V.,
Kinetic energies of products of dissociative photoionization of molecules. I. Aliphatic ketones and alcohols,
Khim. Vys. Energ., 1972, 6, 387. [all data]
Cocksey, Eland, et al., 1971
Cocksey, B.J.; Eland, J.H.D.; Danby, C.J.,
The effect of alkyl substitution on ionisation potential,
J. Chem. Soc., 1971, (B), 790. [all data]
Matthews and Warneck, 1969
Matthews, C.S.; Warneck, P.,
Heats of formation of CHO+ and C3H3+ by photoionization,
J. Chem. Phys. 5, 1969, 1, 854. [all data]
Dewar and Worley, 1969
Dewar, M.J.S.; Worley, S.D.,
Photoelectron spectra of molecules. I. Ionization potentials of some organic molecules and their interpretation,
J. Chem. Phys., 1969, 50, 654. [all data]
Potapov, Filyugina, et al., 1968
Potapov, V.K.; Filyugina, A.D.; Shigorin, D.N.; Ozerova, G.A.,
Photoionization of some compounds containing the carbonyl and amino groups,
Dokl. Akad. Nauk SSSR, 1968, 180, 398, In original 352. [all data]
Vilesov, 1960
Vilesov, F.I.,
The photoionization of vapors of compounds whose molecules contain carbonyl groups,
Dokl. Phys. Chem., 1960, 132, 521, In original 1332. [all data]
Hurzeler, Inghram, et al., 1958
Hurzeler, H.; Inghram, M.G.; Morrison, J.D.,
Photon impact studies of molecules using a mass spectrometer,
J. Chem. Phys., 1958, 28, 76. [all data]
Watanabe, 1957
Watanabe, K.,
Ionization potentials of some molecules,
J. Chem. Phys., 1957, 26, 542. [all data]
Vilesov and Terenin, 1957
Vilesov, F.I.; Terenin, A.N.,
The photoionization of the vapors of certain organic compounds,
Dokl. Akad. Nauk SSSR, 1957, 115, 744, In original 539. [all data]
Walsh, 1946
Walsh, A.D.,
The absorption spectrum of acetaldehyde in the vacuum ultra-violet,
Proc. Roy. Soc. (London), 1946, A185, 176. [all data]
Johnson, Powis, et al., 1982
Johnson, K.; Powis, I.; Danby, C.J.,
A photoelectron-photoion coincidence study of acetaldehyde and ethylene oxide molecular ions,
Chem. Phys., 1982, 70, 329. [all data]
Bieri, Asbrink, et al., 1982
Bieri, G.; Asbrink, L.; Von Niessen, W.,
30.4-nm He(II) photoelectron spectra of organic molecules,
J. Electron Spectrosc. Relat. Phenom., 1982, 27, 129. [all data]
Benoit and Harrison, 1977
Benoit, F.M.; Harrison, A.G.,
Predictive value of proton affinity. Ionization energy correlations involving oxygenated molecules,
J. Am. Chem. Soc., 1977, 99, 3980. [all data]
Rao, 1975
Rao, C.N.R.,
Lone-pair ionization bands of chromophores in the photoelectron spectra of organic molecules,
Indian J. Chem., 1975, 13, 950. [all data]
Kimura, Katsumata, et al., 1975
Kimura, K.; Katsumata, S.; Yamazaki, T.; Wakabayashi, H.,
UV photoelectron spectra and sum rule consideration; out-of-plane orbitals of unsaturated compounds with planar-skeleton structure,
J. Electron Spectrosc. Relat. Phenom., 1975, 6, 41. [all data]
Bombach, Stadelmann, et al., 1981
Bombach, R.; Stadelmann, J.P.; Vogt, J.,
The fragmentation and isomerization of internal energy selected acetaldehyde molecular cations,
Chem. Phys., 1981, 60, 293. [all data]
Haney and Franklin, 1969
Haney, M.A.; Franklin, J.L.,
Excess energies in mass spectra of some oxygen-containing organic compounds,
J. Chem. Soc. Faraday Trans., 1969, 65, 1794. [all data]
Shigorin, Filyugina, et al., 1966
Shigorin, D.N.; Filyugina, A.D.; Potapov, V.K.,
Ionization and dissociation of molecules of acetaldehyde, acetone, and acetic acid on electron impact,
Teor. i Eksperim. Khim., 1966, 2, 554, In original 417. [all data]
Dorman, 1965
Dorman, F.H.,
Fragment ions from CH3CHO and (CH3)2CO by electron impact,
J. Chem. Phys., 1965, 42, 65. [all data]
Burgers and Holmes, 1982
Burgers, P.C.; Holmes, J.L.,
Metastable ion studies. XIII. The measurement of appearance energies of metastable peaks,
Org. Mass Spectrom., 1982, 17, 123. [all data]