Ethylamine
- Formula: C2H7N
- Molecular weight: 45.0837
- IUPAC Standard InChIKey: QUSNBJAOOMFDIB-UHFFFAOYSA-N
- CAS Registry Number: 75-04-7
- Chemical structure:
View 3d structure (requires JavaScript / HTML 5) - Isotopologues:
- Other names: Ethanamine; Aminoethane; Monoethylamine; 1-Aminoethane; C2H5NH2; Aethylamine; Etilamina; Etyloamina; UN 1036

Gas phase thermochemistry data

Data compiled by: Donald R. Burgess, Jr.
Quantity | Value | Units | Method | Reference | Comment |
---|---|---|---|---|---|
ΔfH°gas | -57.7 | kJ/mol | N/A | Lemoult, 1907 | Value computed using ΔfHliquid° value of -84.5 kj/mol from Lemoult, 1907 and ΔvapH° value of 26.8±2 kj/mol from trc clapeyron eqn. |

Condensed phase thermochemistry data

Data compiled by: Hussein Y. Afeefy, Joel F. Liebman, and Stephen E. Stein
Quantity | Value | Units | Method | Reference | Comment |
---|---|---|---|---|---|
ΔfH°liquid | -84.5 | kJ/mol | Ccb | Lemoult, 1907 | |
Quantity | Value | Units | Method | Reference | Comment |
ΔcH°liquid | -1715. | kJ/mol | Ccb | Lemoult, 1907 |

Phase change data

Data compiled as indicated in comments:
BS - Robert L. Brown and Stephen E. Stein
TRC - Thermodynamics Research Center, NIST Boulder Laboratories, Chris Muzny director
AC - William E. Acree, Jr., James S. Chickos
Quantity | Value | Units | Method | Reference | Comment |
---|---|---|---|---|---|
Tboil | 291. ± 2. | K | AVG | N/A | Average of 17 values; Individual data points |
Quantity | Value | Units | Method | Reference | Comment |
Tfus | 191. ± 3. | K | AVG | N/A | Average of 6 values; Individual data points |
Quantity | Value | Units | Method | Reference | Comment |
Tc | 456.55 | K | N/A | Pohland and Mehl, 1933 | Uncertainty assigned by TRC = 1. K; TRC |
Tc | 456.35 | K | N/A | Berthoud, 1917 | Uncertainty assigned by TRC = 1.5 K; TRC |
Quantity | Value | Units | Method | Reference | Comment |
Pc | 56.2759 | bar | N/A | Berthoud, 1917 | Uncertainty assigned by TRC = 0.4053 bar; TRC |
Quantity | Value | Units | Method | Reference | Comment |
ρc | 5.408 | mol/l | N/A | Pohland and Mehl, 1933 | Uncertainty assigned by TRC = 0.22 mol/l; by extrapolation of rectilinera diamters to Tc; TRC |
Enthalpy of vaporization
ΔvapH (kJ/mol) | Temperature (K) | Method | Reference | Comment |
---|---|---|---|---|
29.0 | 282. | A | Stephenson and Malanowski, 1987 | Based on data from 213. to 297. K.; AC |
27.2 | 305. | A | Stephenson and Malanowski, 1987 | Based on data from 290. to 449. K.; AC |
27.6 | 306. | A | Stephenson and Malanowski, 1987 | Based on data from 291. to 387. K.; AC |
25.9 | 392. | A | Stephenson and Malanowski, 1987 | Based on data from 377. to 456. K.; AC |
29.1 | 281. | N/A | Bittrich, Kauer, et al., 1962 | Based on data from 275. to 288. K.; AC |
28.9 | 275. | N/A | Stull, 1947 | Based on data from 190. to 290. K.; AC |
Antoine Equation Parameters
log10(P) = A − (B / (T + C))
P = vapor pressure (bar)
T = temperature (K)
View plot Requires a JavaScript / HTML 5 canvas capable browser.
Temperature (K) | A | B | C | Reference | Comment |
---|---|---|---|---|---|
190.8 to 289.8 | 4.45586 | 1121.445 | -37.854 | Stull, 1947 | Coefficents calculated by NIST from author's data. |
289.8 to 449. | 4.53013 | 1203.822 | -23.716 | Stull, 1947 | Coefficents calculated by NIST from author's data. |

Reaction thermochemistry data

Data compiled as indicated in comments:
M - Michael M. Meot-Ner (Mautner) and Sharon G. Lias
B - John E. Bartmess
ALS - Hussein Y. Afeefy, Joel F. Liebman, and Stephen E. Stein
Individual Reactions
By formula: C3H9Si+ + C2H7N = (C3H9Si+ • C2H7N)
Quantity | Value | Units | Method | Reference | Comment |
---|---|---|---|---|---|
ΔrH° | 240. | kJ/mol | PHPMS | Li and Stone, 1990 | gas phase; switching reaction,Thermochemical ladder((CH3)3Si+)C6H5COOC2H5; Wojtyniak and Stone, 1986; M |
Quantity | Value | Units | Method | Reference | Comment |
ΔrS° | 164. | J/mol*K | PHPMS | Li and Stone, 1990 | gas phase; switching reaction,Thermochemical ladder((CH3)3Si+)C6H5COOC2H5; Wojtyniak and Stone, 1986; M |
By formula: (C2H8N+ • 2C2H7N) + C2H7N = (C2H8N+ • 3C2H7N)
Quantity | Value | Units | Method | Reference | Comment |
---|---|---|---|---|---|
ΔrH° | 72.4 | kJ/mol | HPMS | Zielinska and Wincel, 1974 | gas phase; Entropy change is questionable; M |
Quantity | Value | Units | Method | Reference | Comment |
ΔrS° | 178. | J/mol*K | HPMS | Zielinska and Wincel, 1974 | gas phase; Entropy change is questionable; M |
By formula: (C2H8N+ • C2H7N) + C2H7N = (C2H8N+ • 2C2H7N)
Quantity | Value | Units | Method | Reference | Comment |
---|---|---|---|---|---|
ΔrH° | 81.6 | kJ/mol | HPMS | Zielinska and Wincel, 1974 | gas phase; Entropy change is questionable; M |
Quantity | Value | Units | Method | Reference | Comment |
ΔrS° | 174. | J/mol*K | HPMS | Zielinska and Wincel, 1974 | gas phase; Entropy change is questionable; M |
C2H6N- + =
By formula: C2H6N- + H+ = C2H7N
Quantity | Value | Units | Method | Reference | Comment |
---|---|---|---|---|---|
ΔrH° | 1671. ± 4.6 | kJ/mol | G+TS | MacKay, Hemsworth, et al., 1976 | gas phase; B |
Quantity | Value | Units | Method | Reference | Comment |
ΔrG° | 1638.9 ± 2.9 | kJ/mol | IMRE | MacKay, Hemsworth, et al., 1976 | gas phase; B |
By formula: 2C2H7N = CH5N + C3H9N
Quantity | Value | Units | Method | Reference | Comment |
---|---|---|---|---|---|
ΔrH° | -13.2 | kJ/mol | Eqk | Issoire and Long, 1960 | gas phase; ALS |

Henry's Law data

Data compiled by: Rolf Sander
Henry's Law constant (water solution)
kH(T) = k°H exp(d(ln(kH))/d(1/T) ((1/T) - 1/(298.15 K)))
k°H = Henry's law constant for solubility in water at 298.15 K (mol/(kg*bar))
d(ln(kH))/d(1/T) = Temperature dependence constant (K)
k°H (mol/(kg*bar)) | d(ln(kH))/d(1/T) (K) | Method | Reference |
---|---|---|---|
35. | 3600. | L | N/A |
80. | M | N/A | |
100. | M | N/A |

Gas phase ion energetics data

Data evaluated as indicated in comments:
HL - Edward P. Hunter and Sharon G. Lias
Data compiled as indicated in comments:
B - John E. Bartmess
LBLHLM - Sharon G. Lias, John E. Bartmess, Joel F. Liebman, John L. Holmes, Rhoda D. Levin, and W. Gary Mallard
LLK - Sharon G. Lias, Rhoda D. Levin, and Sherif A. Kafafi
RDSH - Henry M. Rosenstock, Keith Draxl, Bruce W. Steiner, and John T. Herron
Quantity | Value | Units | Method | Reference | Comment |
---|---|---|---|---|---|
Proton affinity (review) | 912.0 | kJ/mol | N/A | Hunter and Lias, 1998 | HL |
Quantity | Value | Units | Method | Reference | Comment |
Gas basicity | 878. | kJ/mol | N/A | Hunter and Lias, 1998 | HL |
Ionization energy determinations
IE (eV) | Method | Reference | Comment |
---|---|---|---|
8.9 | PE | Ohno, Imai, et al., 1985 | LBLHLM |
8.7 | PE | Ohno, Imai, et al., 1983 | LBLHLM |
8.8 ± 0.1 | PE | Aue, Webb, et al., 1976 | LLK |
8.74 | CTS | Slifkin and Allison, 1967 | RDSH |
9.19 | PE | Al-Joboury and Turner, 1964 | RDSH |
8.86 ± 0.02 | PI | Watanabe and Mottl, 1957 | RDSH |
9.50 | PE | Ohno, Imai, et al., 1985 | Vertical value; LBLHLM |
9.50 | PE | Utsunomiya, Kobayashi, et al., 1980 | Vertical value; LLK |
9.471 | PE | Aue, Webb, et al., 1975 | Vertical value; LLK |
9.50 | PE | Ogata, Onizuka, et al., 1973 | Vertical value; LLK |
9.44 ± 0.18 | PE | Leavell, Steichen, et al., 1973 | Vertical value; LLK |
9.50 | PE | Katsumata, Iwai, et al., 1973 | Vertical value; LLK |
Appearance energy determinations
Ion | AE (eV) | Other Products | Method | Reference | Comment |
---|---|---|---|---|---|
CH2N+ | 15.45 | ? | EI | Collin, Franskin, et al., 1967 | RDSH |
CH3+ | 15.6 | CH2NH2 | EI | SenSharma and Franklin, 1973 | LLK |
CH3N+ | 13.5 ± 0.2 | CH4 | EI | Collin, Franskin, et al., 1967 | RDSH |
CH4N+ | 9.69 | CH3 | EI | Lossing, Lam, et al., 1981 | LLK |
CH4N+ | 10.2 ± 0.1 | CH3 | EI | Collin, Franskin, et al., 1967 | RDSH |
CH4N+ | 9.71 | CH3 | PI | Chupka, 1959 | RDSH |
C2H3+ | 16.14 | ? | EI | Collin, Franskin, et al., 1967 | RDSH |
C2H5+ | 13.5 ± 0.2 | ? | EI | Collin, Franskin, et al., 1967 | RDSH |
C2H6N+ | 9.55 | H | EI | Lossing, Lam, et al., 1981 | LLK |
C2H6N+ | 9.61 ± 0.09 | H | EI | Solka and Russell, 1974 | LLK |
C2H6N+ | 12.0 ± 0.1 | H | EI | Collin, Franskin, et al., 1967 | RDSH |
NH3+ | 12.99 | ? | EI | Collin, Franskin, et al., 1967 | RDSH |
H4N+ | 12.72 ± 0.02 | C2H2+H | EI | Haney and Franklin, 1969 | RDSH |
De-protonation reactions
C2H6N- + =
By formula: C2H6N- + H+ = C2H7N
Quantity | Value | Units | Method | Reference | Comment |
---|---|---|---|---|---|
ΔrH° | 1671. ± 4.6 | kJ/mol | G+TS | MacKay, Hemsworth, et al., 1976 | gas phase; B |
Quantity | Value | Units | Method | Reference | Comment |
ΔrG° | 1638.9 ± 2.9 | kJ/mol | IMRE | MacKay, Hemsworth, et al., 1976 | gas phase; B |

Ion clustering data

Data compiled by: Michael M. Meot-Ner (Mautner) and Sharon G. Lias
Clustering reactions
By formula: (C2H8N+ • C2H7N) + C2H7N = (C2H8N+ • 2C2H7N)
Quantity | Value | Units | Method | Reference | Comment |
---|---|---|---|---|---|
ΔrH° | 81.6 | kJ/mol | HPMS | Zielinska and Wincel, 1974 | gas phase; Entropy change is questionable |
Quantity | Value | Units | Method | Reference | Comment |
ΔrS° | 174. | J/mol*K | HPMS | Zielinska and Wincel, 1974 | gas phase; Entropy change is questionable |
By formula: (C2H8N+ • 2C2H7N) + C2H7N = (C2H8N+ • 3C2H7N)
Quantity | Value | Units | Method | Reference | Comment |
---|---|---|---|---|---|
ΔrH° | 72.4 | kJ/mol | HPMS | Zielinska and Wincel, 1974 | gas phase; Entropy change is questionable |
Quantity | Value | Units | Method | Reference | Comment |
ΔrS° | 178. | J/mol*K | HPMS | Zielinska and Wincel, 1974 | gas phase; Entropy change is questionable |
By formula: C3H9Si+ + C2H7N = (C3H9Si+ • C2H7N)
Quantity | Value | Units | Method | Reference | Comment |
---|---|---|---|---|---|
ΔrH° | 240. | kJ/mol | PHPMS | Li and Stone, 1990 | gas phase; switching reaction,Thermochemical ladder((CH3)3Si+)C6H5COOC2H5; Wojtyniak and Stone, 1986 |
Quantity | Value | Units | Method | Reference | Comment |
ΔrS° | 164. | J/mol*K | PHPMS | Li and Stone, 1990 | gas phase; switching reaction,Thermochemical ladder((CH3)3Si+)C6H5COOC2H5; Wojtyniak and Stone, 1986 |

Kovats' RI, non-polar column, isothermal

Column type | Active phase | Temperature (C) | I | Reference | Comment |
---|---|---|---|---|---|
Packed | PMS-100 | 130. | 390. | Anderson, Jurel, et al., 1973 | He, Celite 545 (44-60 mesh); Column length: 3. m |
Packed | PMS-100 | 150. | 379. | Anderson, Jurel, et al., 1973 | He, Celite 545 (44-60 mesh); Column length: 3. m |
Packed | PMS-100 | 180. | 370. | Anderson, Jurel, et al., 1973 | He, Celite 545 (44-60 mesh); Column length: 3. m |
Packed | Apiezon L | 100. | 458. | Golovnya and Zhuravleva, 1973 | |
Packed | Apiezon L | 130. | 441. | Landault and Guiochon, 1964 | Teflon-Haloport; Column length: 2.26 m |

Kovats' RI, polar column, isothermal

Column type | Active phase | Temperature (C) | I | Reference | Comment |
---|---|---|---|---|---|
Packed | PEG-2000 | 152. | 717. | Anderson, Jurel, et al., 1973 | He, Celite 545 (44-60 mesh); Column length: 3. m |
Packed | PEG-2000 | 179. | 712. | Anderson, Jurel, et al., 1973 | He, Celite 545 (44-60 mesh); Column length: 3. m |

Van Den Dool and Kratz RI, non-polar column, custom temperature program

Column type | Active phase | I | Reference | Comment |
---|---|---|---|---|
Capillary | Methyl Silicone | 413. | Peng, Yang, et al., 1991 | Program: not specified |
Packed | SE-30 | 413. | Peng, Ding, et al., 1988 | Supelcoport; Chromosorb; Column length: 3.05 m; Program: 40C(5min) => 10C/min => 200C or 250C (60min) |

Normal alkane RI, non-polar column, custom temperature program

Column type | Active phase | I | Reference | Comment |
---|---|---|---|---|
Capillary | Methyl Silicone | 458. | Chen and Feng, 2007 | Program: not specified |
Capillary | SPB-1 | 408. | Flanagan, Streete, et al., 1997 | 60. m/0.53 mm/5. μm, He; Program: 40C(6min) => 5C/min => 80C => 10C/min => 200C |
Capillary | Polydimethyl siloxanes | 410. | Zenkevich and Chupalov, 1996 | Program: not specified |
Capillary | SPB-1 | 408. | Strete, Ruprah, et al., 1992 | 60. m/0.53 mm/5.0 μm, Helium; Program: 40 0C (6 min) 5 0C/min -> 80 0C 10 0C/min -> 200 0C |

References

Lemoult, 1907
Lemoult, M.P.,
Recherches theoriques et experimentales sur les chaleurs de combustion et de formation des composes organiques,
Ann. Chim. Phys., 1907, 12, 395-432. [all data]
Pohland and Mehl, 1933
Pohland, E.; Mehl, W.,
Physical Properties of Ethylamine.,
Z. Phys. Chem., Abt. A, 1933, 164, 48. [all data]
Berthoud, 1917
Berthoud, A.,
Determination of Critical Temperatures and Pressures of Amines and Alkyl Chlorides,
J. Chim. Phys. Phys.-Chim. Biol., 1917, 15, 3. [all data]
Stephenson and Malanowski, 1987
Stephenson, Richard M.; Malanowski, Stanislaw,
Handbook of the Thermodynamics of Organic Compounds, 1987, https://doi.org/10.1007/978-94-009-3173-2
. [all data]
Bittrich, Kauer, et al., 1962
Bittrich, H.J.; Kauer, E.; Kraft, M.; Sch«65533»ppe, G.; S«65533»ll, W.; Ullrich, A.,
Die Dampfdr«65533»cke der «65533»thylamine,
J. Prakt. Chem., 1962, 17, 5-6, 250-262, https://doi.org/10.1002/prac.19620170502
. [all data]
Stull, 1947
Stull, Daniel R.,
Vapor Pressure of Pure Substances. Organic and Inorganic Compounds,
Ind. Eng. Chem., 1947, 39, 4, 517-540, https://doi.org/10.1021/ie50448a022
. [all data]
Li and Stone, 1990
Li, X.; Stone, A.J.,
Gas-Phase (CH3)3Si+ Affinities of Alkylamines and Proton Affinities of Trimethylsilyl Alkylamines,
Int. J. Mass Spectrom. Ion Proc., 1990, 101, 2-3, 149, https://doi.org/10.1016/0168-1176(90)87008-5
. [all data]
Wojtyniak and Stone, 1986
Wojtyniak, A.C.M.; Stone, A.J.,
A High-Pressure Mass Spectrometric Study of the Bonding of Trimethylsilylium to Oxygen and Aromatic Bases,
Can. J. Chem., 1986, 74, 59. [all data]
Zielinska and Wincel, 1974
Zielinska, T.J.; Wincel, H.,
Gas - Phase Solvation of Protonated Aliphatic Amines: Methyl, Ethyl, n - Propyl, and Iso - Propylamine,
Chem. Phys. Lett., 1974, 25, 354. [all data]
MacKay, Hemsworth, et al., 1976
MacKay, G.J.; Hemsworth, R.S.; Bohme, D.K.,
Absolute gas-phase acidities of CH3NH2, C2H5NH2, (CH3)2NH, and (CH3)3N,
Can. J. Chem., 1976, 54, 1624. [all data]
Issoire and Long, 1960
Issoire, J.; Long, C.,
Etude de la thermodynamique chimique de la reaction de formation des methylamines,
Bull. Soc. Chim. France, 1960, 2004-2012. [all data]
Hunter and Lias, 1998
Hunter, E.P.; Lias, S.G.,
Evaluated Gas Phase Basicities and Proton Affinities of Molecules: An Update,
J. Phys. Chem. Ref. Data, 1998, 27, 3, 413-656, https://doi.org/10.1063/1.556018
. [all data]
Ohno, Imai, et al., 1985
Ohno, K.; Imai, K.; Harada, Y.,
Variations in reactivity of lone-pair electrons due to intramolecular hydrogen bonding as observed by penning ionization electron spectroscopy,
J. Am. Chem. Soc., 1985, 107, 8078. [all data]
Ohno, Imai, et al., 1983
Ohno, K.; Imai, K.; Matsumoto, S.; Harada, Y.,
Penning ionization electron spectroscopy of C2H5X (X = NH2, OH, H, Cl, I) relative reactivity of orbital localizing on functional groups upon electrophilic attack by metastable helium atoms,
J. Phys. Chem., 1983, 87, 4346. [all data]
Aue, Webb, et al., 1976
Aue, D.H.; Webb, H.M.; Bowers, M.T.,
Quantitative proton affinities, ionization potentials, and hydrogen affinities of alkylamines,
J. Am. Chem. Soc., 1976, 98, 311. [all data]
Slifkin and Allison, 1967
Slifkin, M.A.; Allison, A.C.,
Measurement of ionization potentials from contact charge transfer spectra,
Nature, 1967, 215, 949. [all data]
Al-Joboury and Turner, 1964
Al-Joboury, M.I.; Turner, D.W.,
Molecular photoelectron spectroscopy. Part II. A summary of ionization potentials,
J. Chem. Soc., 1964, 4434. [all data]
Watanabe and Mottl, 1957
Watanabe, K.; Mottl, J.R.,
Ionization potentials of ammonia and some amines,
J. Chem. Phys., 1957, 26, 1773. [all data]
Utsunomiya, Kobayashi, et al., 1980
Utsunomiya, C.; Kobayashi, T.; Nagakura, S.,
Photoelectron angular distribution measurements for some aliphatic alcohols, amines, halides,
Bull. Chem. Soc. Jpn., 1980, 53, 1216. [all data]
Aue, Webb, et al., 1975
Aue, D.H.; Webb, H.M.; Bowers, M.T.,
Proton affinities, ionization potentials, and hydrogen affinities of nitrogen and oxygen bases. Hybridization effects,
J. Am. Chem. Soc., 1975, 97, 4137. [all data]
Ogata, Onizuka, et al., 1973
Ogata, H.; Onizuka, H.; Nihei, Y.; Kamada, H.,
The photoelectron spectra of alcohols, mercaptans and amines,
Bull. Chem. Soc. Jpn., 1973, 46, 3036. [all data]
Leavell, Steichen, et al., 1973
Leavell, S.; Steichen, J.; Franklin, J.L.,
Photoelectron spectra of intramolecularly hydrogen bonded compounds,
J. Chem. Phys., 1973, 59, 4343. [all data]
Katsumata, Iwai, et al., 1973
Katsumata, S.; Iwai, T.; Kimura, K.,
Photoelectron spectra and sum rule consideration. Higher alkyl amines and alcohols,
Bull. Chem. Soc. Jpn., 1973, 46, 3391. [all data]
Collin, Franskin, et al., 1967
Collin, J.E.; Franskin, M.J.; Hyatt, D.,
Etude par spectrometrie de masse des mechanismes de dissociation dans l'ethylamine et ses homologues deuteres,
Bull. Soc. Roy. Sci. Liege, 1967, 36, 318. [all data]
SenSharma and Franklin, 1973
SenSharma, D.K.; Franklin, J.L.,
Heat of formation of free radicals by mass spectrometry,
J. Am. Chem. Soc., 1973, 95, 6562. [all data]
Lossing, Lam, et al., 1981
Lossing, F.P.; Lam, Y.-T.; Maccoll, A.,
Gas phase heats of formation of alkyl immonium ions,
Can. J. Chem., 1981, 59, 2228. [all data]
Chupka, 1959
Chupka, W.A.,
Effect of unimolecular decay kinetics on the interpretation of appearance potentials,
J. Chem. Phys., 1959, 30, 191. [all data]
Solka and Russell, 1974
Solka, B.H.; Russell, M.E.,
Energetics of formation of some structural isomers of gaseous C2H5O+ C2H6N+ ions,
J. Phys. Chem., 1974, 78, 1268. [all data]
Haney and Franklin, 1969
Haney, M.A.; Franklin, J.L.,
Heats of formation of H3O+, H3S+, and NH4+ by electron impact,
J. Chem. Phys., 1969, 50, 2028. [all data]