Ethane, iodo-
- Formula: C2H5I
- Molecular weight: 155.9656
- IUPAC Standard InChIKey: HVTICUPFWKNHNG-UHFFFAOYSA-N
- CAS Registry Number: 75-03-6
- Chemical structure:
View 3d structure (requires JavaScript / HTML 5) - Other names: Ethyl iodide; Hydriodic ether; Iodoethane; Monoiodoethane; C2H5I; Ethyljodid; Jodethan; 1-Iodoethane; NSC 8825

Gas phase thermochemistry data

Data compiled by: Hussein Y. Afeefy, Joel F. Liebman, and Stephen E. Stein
Quantity | Value | Units | Method | Reference | Comment |
---|---|---|---|---|---|
ΔfH°gas | -7.2 ± 0.8 | kJ/mol | Ccb | Carson, Laye, et al., 1994 | |
ΔfH°gas | -8.4 | kJ/mol | Cm | Kudchadker and Kudchadker, 1979 | |
ΔfH°gas | -8.8 ± 0.8 | kJ/mol | Chyd | Ashcroft, Carson, et al., 1965 | |
ΔfH°gas | -5.4 | kJ/mol | Ccb | Springall and White, 1949 |

Condensed phase thermochemistry data

Data compiled as indicated in comments:
ALS - Hussein Y. Afeefy, Joel F. Liebman, and Stephen E. Stein
DH - Eugene S. Domalski and Elizabeth D. Hearing
Quantity | Value | Units | Method | Reference | Comment |
---|---|---|---|---|---|
ΔfH°liquid | -39.1 ± 0.8 | kJ/mol | Ccb | Carson, Laye, et al., 1994 | ALS |
ΔfH°liquid | -39.5 ± 1.7 | kJ/mol | Chyd | Ashcroft, Carson, et al., 1965 | Reanalyzed by Pedley, Naylor, et al., 1986, Original value = -40. ± 0.8 kJ/mol; ALS |
ΔfH°liquid | -35. | kJ/mol | Ccb | Springall and White, 1949 | ALS |
Quantity | Value | Units | Method | Reference | Comment |
ΔcH°liquid | -1462.5 ± 0.4 | kJ/mol | Ccb | Carson, Laye, et al., 1994 | ALS |
ΔcH°liquid | -1466. ± 2. | kJ/mol | Ccb | Springall and White, 1949 | ALS |
Constant pressure heat capacity of liquid
Cp,liquid (J/mol*K) | Temperature (K) | Reference | Comment |
---|---|---|---|
109.7 | 298.15 | Shehatta, 1993 | DH |
115.1 | 298. | Kurbatov, 1948 | T = -37 to 70°C; mean Cp, three temperatures.; DH |

Phase change data

Data compiled as indicated in comments:
BS - Robert L. Brown and Stephen E. Stein
TRC - Thermodynamics Research Center, NIST Boulder Laboratories, Chris Muzny director
AC - William E. Acree, Jr., James S. Chickos
ALS - Hussein Y. Afeefy, Joel F. Liebman, and Stephen E. Stein
Quantity | Value | Units | Method | Reference | Comment |
---|---|---|---|---|---|
Tboil | 345.5 ± 0.9 | K | AVG | N/A | Average of 12 values; Individual data points |
Quantity | Value | Units | Method | Reference | Comment |
Tfus | 162.05 | K | N/A | Timmermans and Martin, 1928 | Uncertainty assigned by TRC = 0.4 K; TRC |
Tfus | 162.3 | K | N/A | Timmermans, 1911 | Uncertainty assigned by TRC = 0.4 K; TRC |
Quantity | Value | Units | Method | Reference | Comment |
ΔvapH° | 32.05 | kJ/mol | N/A | Majer and Svoboda, 1985 | |
ΔvapH° | 31.7 | kJ/mol | CGC | Chickos, Hosseini, et al., 1995 | Based on data from 313. to 353. K.; AC |
ΔvapH° | 31.9 ± 0.1 | kJ/mol | C | Wadsö, Luoma, et al., 1968 | AC |
ΔvapH° | 31.93 ± 0.02 | kJ/mol | C | Wadso, 1968 | ALS |
ΔvapH° | 29.8 ± 0.3 | kJ/mol | V | Mathews, 1926 | ALS |
Enthalpy of vaporization
ΔvapH (kJ/mol) | Temperature (K) | Method | Reference | Comment |
---|---|---|---|---|
29.44 | 345.6 | N/A | Majer and Svoboda, 1985 | |
33.6 | 264. | E | Stephenson and Malanowski, 1987 | Based on data from 249. to 369. K. See also Li and Rossini, 1961.; AC |
34.7 | 234. | N/A | Stull, 1947 | Based on data from 219. to 345. K.; AC |
32. | 278. | N/A | Milazzo, 1944 | Based on data from 254. to 293. K.; AC |
31.7 | 318. | N/A | Smyth and Engel, 1929 | Based on data from 303. to 333. K.; AC |
Antoine Equation Parameters
log10(P) = A − (B / (T + C))
P = vapor pressure (bar)
T = temperature (K)
View plot Requires a JavaScript / HTML 5 canvas capable browser.
Temperature (K) | A | B | C | Reference | Comment |
---|---|---|---|---|---|
218.8 to 345.6 | 4.08511 | 1247.135 | -39.612 | Stull, 1947 | Coefficents calculated by NIST from author's data. |
303. to 333. | 4.01326 | 1192.892 | -48.095 | Smyth and Engel, 1929 | Coefficents calculated by NIST from author's data. |

Reaction thermochemistry data

Data compiled by: Hussein Y. Afeefy, Joel F. Liebman, and Stephen E. Stein
Individual Reactions
By formula: H2 + 2C2H5I = 2C2H6 + I2
Quantity | Value | Units | Method | Reference | Comment |
---|---|---|---|---|---|
ΔrH° | -88.7 ± 3.3 | kJ/mol | Chyd | Ashcroft, Carson, et al., 1965 | liquid phase |

Henry's Law data

Data compiled by: Rolf Sander
Henry's Law constant (water solution)
kH(T) = k°H exp(d(ln(kH))/d(1/T) ((1/T) - 1/(298.15 K)))
k°H = Henry's law constant for solubility in water at 298.15 K (mol/(kg*bar))
d(ln(kH))/d(1/T) = Temperature dependence constant (K)
k°H (mol/(kg*bar)) | d(ln(kH))/d(1/T) (K) | Method | Reference | Comment |
---|---|---|---|---|
0.18 | Q | N/A | missing citation give several references for the Henry's law constants but don't assign them to specific species. Value at T = 293. K. | |
0.14 | V | N/A |

Gas phase ion energetics data

Data evaluated as indicated in comments:
HL - Edward P. Hunter and Sharon G. Lias
L - Sharon G. Lias
Data compiled as indicated in comments:
LL - Sharon G. Lias and Joel F. Liebman
LBLHLM - Sharon G. Lias, John E. Bartmess, Joel F. Liebman, John L. Holmes, Rhoda D. Levin, and W. Gary Mallard
LLK - Sharon G. Lias, Rhoda D. Levin, and Sherif A. Kafafi
RDSH - Henry M. Rosenstock, Keith Draxl, Bruce W. Steiner, and John T. Herron
Quantity | Value | Units | Method | Reference | Comment |
---|---|---|---|---|---|
IE (evaluated) | 9.349 ± 0.001 | eV | N/A | N/A | L |
Quantity | Value | Units | Method | Reference | Comment |
Proton affinity (review) | 724.8 | kJ/mol | N/A | Hunter and Lias, 1998 | HL |
Quantity | Value | Units | Method | Reference | Comment |
Gas basicity | 698.3 | kJ/mol | N/A | Hunter and Lias, 1998 | HL |
Ionization energy determinations
IE (eV) | Method | Reference | Comment |
---|---|---|---|
9.3492 ± 0.0006 | TE | Knoblauch, Strobel, et al., 1995 | LL |
9.33 | EST | Luo and Pacey, 1992 | LL |
9.33 | PE | Carlson, Gerard, et al., 1988 | LL |
9.3 | PE | Ohno, Imai, et al., 1983 | LBLHLM |
9.35 | PE | Kimura, Katsumata, et al., 1981 | LLK |
9.346 ± 0.005 | EQ | Lias and Ausloos, 1978 | LLK |
9.35 ± 0.02 | PE | Boschi and Salahub, 1974 | LLK |
9.346 | S | Boschi and Salahub, 1972 | LLK |
9.35 | PE | Brogli and Heilbronner, 1971 | LLK |
9.37 | PE | Baker, Betteridge, et al., 1971 | LLK |
9.37 | PE | Baker, Betteridge, et al., 1971 | LLK |
9.35 ± 0.02 | EI | Melton and Hamill, 1964 | RDSH |
9.33 ± 0.01 | PI | Watanabe, 1957 | RDSH |
9.346 ± 0.005 | S | Price, 1936 | RDSH |
9.35 | PE | Carlson, Gerard, et al., 1988 | Vertical value; LL |
9.33 | PE | Utsunomiya, Kobayashi, et al., 1980 | Vertical value; LLK |
9.34 | PE | Hoppilliard and Solgadi, 1980 | Vertical value; LLK |
9.6 | PE | Dromey and Peel, 1974 | Vertical value; LLK |
9.45 ± 0.02 | PE | Leavell, Steichen, et al., 1973 | Vertical value; LLK |
9.34 | PE | Kimura, Katsumata, et al., 1973 | Vertical value; LLK |
Appearance energy determinations
Ion | AE (eV) | Other Products | Method | Reference | Comment |
---|---|---|---|---|---|
CH2I+ | 13.7 ± 0.3 | CH3 | EI | Irsa, 1957 | RDSH |
CH3+ | 16.3 ± 0.3 | ? | EI | Irsa, 1957 | RDSH |
C2H5+ | 10.44 | I | PI | Traeger and McLoughlin, 1981 | LLK |
C2H5+ | 10.49 | I | PIPECO | Baer, 1980 | LLK |
C2H5+ | 11.0 ± 0.3 | I | EI | Irsa, 1957 | RDSH |
HI+ | 11.7 ± 0.1 | ? | EI | Irsa, 1957 | RDSH |
I+ | 14.8 ± 0.2 | ? | EI | Irsa, 1957 | RDSH |

Kovats' RI, non-polar column, isothermal

Column type | Active phase | Temperature (C) | I | Reference | Comment |
---|---|---|---|---|---|
Packed | OV-1 | 100. | 614. | Castello and Gerbino, 1988 | He, Chromosorb W DMCS; Column length: 3. m |
Packed | OV-1 | 125. | 621. | Castello and Gerbino, 1988 | He, Chromosorb W DMCS; Column length: 3. m |
Packed | OV-1 | 75. | 607. | Castello and Gerbino, 1988 | He, Chromosorb W DMCS; Column length: 3. m |
Packed | Porapack Q | 200. | 586. | Goebel, 1982 | N2 |
Packed | Apolane | 70. | 617.6 | Riedo, Fritz, et al., 1976 | He, Chromosorb; Column length: 2.4 m |
Packed | Squalane | 27. | 591. | Hively and Hinton, 1968 | He, Chromosorb P; Column length: 15. m; Column diameter: 0.25 mm |
Packed | Squalane | 49. | 598. | Hively and Hinton, 1968 | He, Chromosorb P; Column length: 15. m; Column diameter: 0.25 mm |
Packed | Squalane | 86. | 609. | Hively and Hinton, 1968 | He, Chromosorb P; Column length: 15. m; Column diameter: 0.25 mm |

Kovats' RI, polar column, isothermal

Column type | Active phase | Temperature (C) | I | Reference | Comment |
---|---|---|---|---|---|
Packed | SP-1000 | 100. | 901.65 | Castello and Gerbino, 1988 | He, Chromosorb W DMCS; Column length: 3. m |
Packed | SP-1000 | 125. | 899.84 | Castello and Gerbino, 1988 | He, Chromosorb W DMCS; Column length: 3. m |
Packed | SP-1000 | 75. | 896.49 | Castello and Gerbino, 1988 | He, Chromosorb W DMCS; Column length: 3. m |
Packed | Carbowax 20M | 75. | 892. | Goebel, 1982 | N2, Kieselgur (60-100 mesh); Column length: 2. m |

Van Den Dool and Kratz RI, non-polar column, temperature ramp

Column type | Active phase | I | Reference | Comment |
---|---|---|---|---|
Capillary | DB-1 | 602. | Helmig and Greenberg, 1995 | 60. m/0.33 mm/0.25 μm, 6. K/min; Tstart: -50. C; Tend: 180. C |
Capillary | SE-54 | 616. | Weber, 1986 | 25. m/0.31 mm/0.17 μm, H2, 2. K/min; Tstart: 35. C |

Van Den Dool and Kratz RI, polar column, temperature ramp

Column type | Active phase | I | Reference | Comment |
---|---|---|---|---|
Capillary | DB-Wax | 881. | Peng, 2000 | 15. m/0.53 mm/1. μm, He, 40. C @ 3. min, 5. K/min, 220. C @ 30. min |

Normal alkane RI, non-polar column, temperature ramp

Column type | Active phase | I | Reference | Comment |
---|---|---|---|---|
Capillary | OV-101 | 602. | Dimov and Milina, 1989 | H2, 2. K/min; Column length: 50. m; Column diameter: 0.32 mm; Tstart: 40. C; Tend: 280. C |

Normal alkane RI, non-polar column, custom temperature program

Column type | Active phase | I | Reference | Comment |
---|---|---|---|---|
Capillary | SPB-1 | 601. | Flanagan, Streete, et al., 1997 | 60. m/0.53 mm/5. μm, He; Program: 40C(6min) => 5C/min => 80C => 10C/min => 200C |
Capillary | DB-1 | 600. | Helmig and Greenberg, 1995 | 60. m/0.33 mm/0.25 μm; Program: not specified |
Capillary | SPB-1 | 601. | Strete, Ruprah, et al., 1992 | 60. m/0.53 mm/5.0 μm, Helium; Program: 40 0C (6 min) 5 0C/min -> 80 0C 10 0C/min -> 200 0C |

Normal alkane RI, polar column, custom temperature program

Column type | Active phase | I | Reference | Comment |
---|---|---|---|---|
Capillary | DB-Wax | 876. | Peng, Yang, et al., 1991 | Program: not specified |
Capillary | Carbowax 400, Carbowax 20M, Carbowax 1540, Carbowax 4000, Superox 06, PEG 20M, etc. | 892. | Waggott and Davies, 1984 | Hydrogen; Column length: 50. m; Column diameter: 0.32 mm; Program: not specified |
Capillary | Carbowax 20M | 880. | Ramsey and Flanagan, 1982 | Program: not specified |

References

Carson, Laye, et al., 1994
Carson, A.S.; Laye, P.G.; Pedley, J.B.; Welsby, A.M.; Chickos, J.S.; Hosseini, S.,
The enthalpies of formation of iodoethane, 1,2-diiodoethane, 1,3-diiodopropane, and 1,4-diiodobutane,
J. Chem. Thermodyn., 1994, 26, 1103-1109. [all data]
Kudchadker and Kudchadker, 1979
Kudchadker, S.A.; Kudchadker, A.P.,
Ideal gas thermodynamic properties of selected bromoethanes and iodoethane,
J. Phys. Chem. Ref. Data, 1979, 8, 519-526. [all data]
Ashcroft, Carson, et al., 1965
Ashcroft, S.J.; Carson, A.S.; Carter, W.; Laye, P.G.,
Thermochemistry of reductions caused by lithium aluminium hydride. Part 3.- The C-halogen bond dissociation energies in ethyl iodine and ethyl bromide,
Trans. Faraday Soc., 1965, 61, 225-229. [all data]
Springall and White, 1949
Springall, H.D.; White, T.R.,
The heat of combustion of ethyl iodide,
Res. Corresp., 1949, 2, 296. [all data]
Pedley, Naylor, et al., 1986
Pedley, J.B.; Naylor, R.D.; Kirby, S.P.,
Thermochemical Data of Organic Compounds, Chapman and Hall, New York, 1986, 1-792. [all data]
Shehatta, 1993
Shehatta, I.,
Heat capacity at constant pressure of some halogen compounds,
Thermochim. Acta, 1993, 213, 1-10. [all data]
Kurbatov, 1948
Kurbatov, V.Ya.,
Heat capacity of liquids. 2. Heat capacity and the temperature dependence of heat capacity from halogen derivatives of acylic hydrocarbons,
Zh. Obshch. Kim., 1948, 18, 372-389. [all data]
Timmermans and Martin, 1928
Timmermans, J.; Martin, F.,
Study of the Physical Constants of Twenty Organic Compounds of the Physical Constants of Twenty Organic Compounds,
J. Chim. Phys. Phys.-Chim. Biol., 1928, 25, 411. [all data]
Timmermans, 1911
Timmermans, J.,
Researches on the freezing point of organic liquid compounds,
Bull. Soc. Chim. Belg., 1911, 25, 300. [all data]
Majer and Svoboda, 1985
Majer, V.; Svoboda, V.,
Enthalpies of Vaporization of Organic Compounds: A Critical Review and Data Compilation, Blackwell Scientific Publications, Oxford, 1985, 300. [all data]
Chickos, Hosseini, et al., 1995
Chickos, James S.; Hosseini, Sarah; Hesse, Donald G.,
Determination of vaporization enthalpies of simple organic molecules by correlations of changes in gas chromatographic net retention times,
Thermochimica Acta, 1995, 249, 41-62, https://doi.org/10.1016/0040-6031(95)90670-3
. [all data]
Wadsö, Luoma, et al., 1968
Wadsö, Ingemar; Luoma, Sinikka; Olson, Thomas; Norin, Torbjörn,
Heats of Vaporization of Organic Compounds. II. Chlorides, Bromides, and Iodides.,
Acta Chem. Scand., 1968, 22, 2438-2444, https://doi.org/10.3891/acta.chem.scand.22-2438
. [all data]
Wadso, 1968
Wadso, I.,
Heats of vaporization of organic compounds II. Chlorides, bromides, and iodides,
Acta Chem. Scand., 1968, 22, 2438. [all data]
Mathews, 1926
Mathews, J.H.,
The accurate measurement of heats of vaporization of liquids,
J. Am. Chem. Soc., 1926, 48, 562-576. [all data]
Stephenson and Malanowski, 1987
Stephenson, Richard M.; Malanowski, Stanislaw,
Handbook of the Thermodynamics of Organic Compounds, 1987, https://doi.org/10.1007/978-94-009-3173-2
. [all data]
Li and Rossini, 1961
Li, J.C.M.; Rossini, F.D.,
Vapor Pressures and Boiling Points of the l-Fluoroalkanes, l-Chloroalkanes, l-Bromoalkanes, and l-Iodoalkanes, C 1 to C 20 .,
J. Chem. Eng. Data, 1961, 6, 2, 268-270, https://doi.org/10.1021/je60010a025
. [all data]
Stull, 1947
Stull, Daniel R.,
Vapor Pressure of Pure Substances. Organic and Inorganic Compounds,
Ind. Eng. Chem., 1947, 39, 4, 517-540, https://doi.org/10.1021/ie50448a022
. [all data]
Milazzo, 1944
Milazzo, G.,
Gazz. Chim. Ital., 1944, 74, 49. [all data]
Smyth and Engel, 1929
Smyth, C.P.; Engel, E.W.,
MOLECULAR ORIENTATION AND THE PARTIAL VAPOR PRESSURES OF BINARY MIXTURES. I. SYSTEMS COMPOSED OF NORMAL LIQUIDS,
J. Am. Chem. Soc., 1929, 51, 9, 2646-2660, https://doi.org/10.1021/ja01384a006
. [all data]
Hunter and Lias, 1998
Hunter, E.P.; Lias, S.G.,
Evaluated Gas Phase Basicities and Proton Affinities of Molecules: An Update,
J. Phys. Chem. Ref. Data, 1998, 27, 3, 413-656, https://doi.org/10.1063/1.556018
. [all data]
Knoblauch, Strobel, et al., 1995
Knoblauch, N.; Strobel, A.; Fischer, I.; Bondybey, V.E.,
Two-photon ionization and dissociation of ethyl iodide,
J. Chem. Phys., 1995, 103, 5417. [all data]
Luo and Pacey, 1992
Luo, Y.-R.; Pacey, P.D.,
Effects of alkyl substitution on ionization energies of alkanes and haloalkanes and on heats of formation of their molecular cations. Part 2. Alkanes and chloro-, bromo- and iodoalkanes,
Int. J. Mass Spectrom. Ion Processes, 1992, 112, 63. [all data]
Carlson, Gerard, et al., 1988
Carlson, T.A.; Gerard, P.; Pullen, B.P.; Grimm, F.A.,
Autoionization from the ione-pair orbitals of molecules containing iodine,
J. Chem. Phys., 1988, 89, 1464. [all data]
Ohno, Imai, et al., 1983
Ohno, K.; Imai, K.; Matsumoto, S.; Harada, Y.,
Penning ionization electron spectroscopy of C2H5X (X = NH2, OH, H, Cl, I) relative reactivity of orbital localizing on functional groups upon electrophilic attack by metastable helium atoms,
J. Phys. Chem., 1983, 87, 4346. [all data]
Kimura, Katsumata, et al., 1981
Kimura, K.; Katsumata, S.; Achiba, Y.; Yamazaki, T.; Iwata, S.,
Ionization energies, Ab initio assignments, and valence electronic structure for 200 molecules
in Handbook of HeI Photoelectron Spectra of Fundamental Organic Compounds, Japan Scientific Soc. Press, Tokyo, 1981. [all data]
Lias and Ausloos, 1978
Lias, S.G.; Ausloos, P.J.,
eIonization energies of organic compounds by equilibrium measurements,
J. Am. Chem. Soc., 1978, 100, 6027. [all data]
Boschi and Salahub, 1974
Boschi, R.A.A.; Salahub, D.R.,
The high resolution photoelectron spectra of some iodoalkanes, iodocycloalkanes, iodoalkenes, and fluoroiodohydrocarbons,
Can. J. Chem., 1974, 52, 1217. [all data]
Boschi and Salahub, 1972
Boschi, R.A.; Salahub, D.R.,
The far ultra-violet spectra of some 1-iodoalkanes,
Mol. Phys., 1972, 24, 289. [all data]
Brogli and Heilbronner, 1971
Brogli, F.; Heilbronner, E.,
The competition between spin orbit coupling and conjugation in alkyl halides and its repercussion on their photoelectron spectra,
Helv. Chim. Acta, 1971, 54, 1423. [all data]
Baker, Betteridge, et al., 1971
Baker, A.D.; Betteridge, D.; Kemp, N.R.; Kirby, R.E.,
Application of photoelectron spectrometry to pesticide analysis. II.Photoelectron spectra of hydroxy-, and halo-alkanes and halohydrins,
Anal. Chem., 1971, 43, 375. [all data]
Melton and Hamill, 1964
Melton, C.E.; Hamill, W.H.,
Appearance potentials by the retarding potential-difference method for secondary ions produced by excited-neutral, excited ion-neutral, and ion-neutral reactions,
J. Chem. Phys., 1964, 41, 1469. [all data]
Watanabe, 1957
Watanabe, K.,
Ionization potentials of some molecules,
J. Chem. Phys., 1957, 26, 542. [all data]
Price, 1936
Price, W.C.,
The far ultraviolet absorption spectra and ionization potentials of the alkyl halides. Part II,
J. Chem. Phys., 1936, 4, 547. [all data]
Utsunomiya, Kobayashi, et al., 1980
Utsunomiya, C.; Kobayashi, T.; Nagakura, S.,
Photoelectron angular distribution measurements for some aliphatic alcohols, amines, halides,
Bull. Chem. Soc. Jpn., 1980, 53, 1216. [all data]
Hoppilliard and Solgadi, 1980
Hoppilliard, Y.; Solgadi, D.,
Conformational analysis of 2-haloethanols and 2-methoxyethylhalides in a photoelectron spectrometer,
Tetrahedron, 1980, 36, 377. [all data]
Dromey and Peel, 1974
Dromey, R.G.; Peel, J.B.,
Photoelectron spectroscopic correlation of the molecular orbitals of the alkanes and alkyl iodides,
J. Mol. Struct., 1974, 23, 53. [all data]
Leavell, Steichen, et al., 1973
Leavell, S.; Steichen, J.; Franklin, J.L.,
Photoelectron spectra of intramolecularly hydrogen bonded compounds,
J. Chem. Phys., 1973, 59, 4343. [all data]
Kimura, Katsumata, et al., 1973
Kimura, K.; Katsumata, S.; Achiba, Y.; Matsumoto, H.; Nagakura, S.,
Photoelectron spectra and orbital structures of higher alkyl chlorides, bromides, and iodides.,
Bull. Chem. Soc. Jpn., 1973, 46, 373. [all data]
Irsa, 1957
Irsa, A.P.,
Electron impact studies on C2H5Cl, C2H5Br, and C2H5I,
J. Chem. Phys., 1957, 26, 18. [all data]
Traeger and McLoughlin, 1981
Traeger, J.C.; McLoughlin, R.G.,
Absolute heats of formation for gas phase cations,
J. Am. Chem. Soc., 1981, 103, 3647. [all data]
Baer, 1980
Baer, T.,
Gas phase heats of formation of C2H5+ and C3H7+,
J. Am. Chem. Soc., 1980, 102, 2482. [all data]
Kimura and Nagakura, 1961
Kimura, K.; Nagakura, S.,
n → σ* Absorption spectra of saturated organic compounds containing bromine and iodine,
Spectrochim. Acta, 1961, 17, 166-183. [all data]