Propane
- Formula: C3H8
- Molecular weight: 44.0956
- IUPAC Standard InChIKey: ATUOYWHBWRKTHZ-UHFFFAOYSA-N
- CAS Registry Number: 74-98-6
- Chemical structure:
View 3d structure (requires JavaScript / HTML 5) - Isotopologues:
- Other names: n-Propane; Dimethylmethane; Freon 290; Liquefied petroleum gas; LPG; Propyl hydride; R 290; C3H8; UN 1978; A-108; Hydrocarbon propellant A-108; HC 290

Gas phase thermochemistry data

Data compiled as indicated in comments:
ALS - Hussein Y. Afeefy, Joel F. Liebman, and Stephen E. Stein
GT - Glushko Thermocenter, Russian Academy of Sciences, Moscow
Quantity | Value | Units | Method | Reference | Comment |
---|---|---|---|---|---|
ΔfH°gas | -104.7 ± 0.50 | kJ/mol | Ccb | Pittam and Pilcher, 1972 | ALS |
ΔfH°gas | -103.8 ± 0.59 | kJ/mol | Ccb | Prosen and Rossini, 1945 | Hf derived from Heat of Hydrogenation; ALS |
Quantity | Value | Units | Method | Reference | Comment |
ΔcH°gas | -2219.2 ± 0.46 | kJ/mol | Ccb | Pittam and Pilcher, 1972 | Corresponding ΔfHºgas = -104.7 kJ/mol (simple calculation by NIST; no Washburn corrections); ALS |
ΔcH°gas | -2204.0 ± 0.54 | kJ/mol | Ccb | Prosen and Rossini, 1945 | Hf derived from Heat of Hydrogenation; Corresponding ΔfHºgas = -119.8 kJ/mol (simple calculation by NIST; no Washburn corrections); ALS |
ΔcH°gas | -2219.9 ± 0.50 | kJ/mol | Ccb | Rossini, 1934 | Corresponding ΔfHºgas = -103.9 kJ/mol (simple calculation by NIST; no Washburn corrections); ALS |
ΔcH°gas | -2207. | kJ/mol | Ccb | Guinchant, 1918 | Corresponding ΔfHºgas = -117. kJ/mol (simple calculation by NIST; no Washburn corrections); ALS |
Constant pressure heat capacity of gas
Cp,gas (J/mol*K) | Temperature (K) | Reference | Comment |
---|---|---|---|
34.06 | 50. | Chao J., 1973 | Recommended values are in good agreement with those calculated by [ Pitzer K.S., 1944].; GT |
41.30 | 100. | ||
48.79 | 150. | ||
56.07 | 200. | ||
68.74 | 273.15 | ||
73.60 | 298.15 | ||
73.93 | 300. | ||
94.01 | 400. | ||
112.59 | 500. | ||
128.70 | 600. | ||
142.67 | 700. | ||
154.77 | 800. | ||
165.35 | 900. | ||
174.60 | 1000. | ||
182.67 | 1100. | ||
189.74 | 1200. | ||
195.85 | 1300. | ||
201.21 | 1400. | ||
205.89 | 1500. |
Constant pressure heat capacity of gas
Cp,gas (J/mol*K) | Temperature (K) | Reference | Comment |
---|---|---|---|
48.91 | 148.2 | Ernst G., 1970 | Please also see Kistiakowsky G.B., 1940, Kistiakowsky G.B., 1940, 2, Dailey B.P., 1943.; GT |
50.38 | 157.8 | ||
58.58 | 213.1 | ||
59.29 | 219.2 | ||
65.90 | 258.0 | ||
67.74 | 272.38 | ||
72.67 ± 0.07 | 293.15 | ||
73.55 | 300.37 | ||
76.11 ± 0.08 | 313.15 | ||
80.30 ± 0.08 | 333.15 | ||
80.54 | 334.05 | ||
82.26 | 343.65 | ||
84.40 ± 0.08 | 353.15 | ||
85.19 | 360.05 | ||
87.45 | 368.55 | ||
90.46 | 387.75 | ||
104.89 | 452.55 | ||
116.69 | 521.15 | ||
121.75 | 561.95 | ||
128.66 | 603.25 | ||
140.62 | 693.15 |

Condensed phase thermochemistry data

Data compiled as indicated in comments:
ALS - Hussein Y. Afeefy, Joel F. Liebman, and Stephen E. Stein
DH - Eugene S. Domalski and Elizabeth D. Hearing
Quantity | Value | Units | Method | Reference | Comment |
---|---|---|---|---|---|
ΔfH°liquid | -119.8 ± 0.59 | kJ/mol | Ccb | Prosen and Rossini, 1945 | Hf derived from Heat of Hydrogenation; ALS |
Quantity | Value | Units | Method | Reference | Comment |
S°liquid | 171.0 | J/mol*K | N/A | Kemp and Egan, 1938 | Debye extrapolation, 0 to 15 K.; DH |
Constant pressure heat capacity of liquid
Cp,liquid (J/mol*K) | Temperature (K) | Reference | Comment |
---|---|---|---|
98.36 | 230. | Vas'kov, 1982 | T = 90 to 230 K. Cp given as 2.2305 J/g*K.; DH |
119.6 | 300. | Goodwin, 1978 | T = 81 to 289 K. Cp data reported for an extended data set; unsmoothed experimental datum.; DH |
98.28 | 230. | Kemp and Egan, 1938 | T = 15 to 230 K.; DH |

Phase change data

Data compiled as indicated in comments:
BS - Robert L. Brown and Stephen E. Stein
TRC - Thermodynamics Research Center, NIST Boulder Laboratories, Chris Muzny director
DH - Eugene S. Domalski and Elizabeth D. Hearing
AC - William E. Acree, Jr., James S. Chickos
Quantity | Value | Units | Method | Reference | Comment |
---|---|---|---|---|---|
Tboil | 231.1 ± 0.2 | K | AVG | N/A | Average of 17 out of 21 values; Individual data points |
Quantity | Value | Units | Method | Reference | Comment |
Tfus | 85.5 | K | N/A | Streng, 1971 | Uncertainty assigned by TRC = 0.2 K; TRC |
Tfus | 85.46 | K | N/A | Klipping and Schmidt, 1965 | Uncertainty assigned by TRC = 0.2 K; TRC |
Tfus | 83.25 | K | N/A | Harteck and Edse, 1938 | Uncertainty assigned by TRC = 0.5 K; TRC |
Tfus | 86.05 | K | N/A | Hicks-Brunn and Bruun, 1936 | Uncertainty assigned by TRC = 0.15 K; TRC |
Tfus | 85.35 | K | N/A | Timmermans, 1921 | Uncertainty assigned by TRC = 0.5 K; TRC |
Quantity | Value | Units | Method | Reference | Comment |
Ttriple | 85. ± 3. | K | AVG | N/A | Average of 7 values; Individual data points |
Quantity | Value | Units | Method | Reference | Comment |
Ptriple | 1.685×10-9 | bar | N/A | Younglove and Ely, 1987 | Uncertainty assigned by TRC = 1.×10-12 bar; TRC |
Ptriple | 1.6895×10-9 | bar | N/A | Goodwin and Haynes, 1982 | TRC |
Quantity | Value | Units | Method | Reference | Comment |
Tc | 369.9 ± 0.2 | K | AVG | N/A | Average of 30 out of 37 values; Individual data points |
Quantity | Value | Units | Method | Reference | Comment |
Pc | 42.5 ± 0.1 | bar | AVG | N/A | Average of 25 out of 32 values; Individual data points |
Quantity | Value | Units | Method | Reference | Comment |
Vc | 0.200 | l/mol | N/A | Ambrose and Tsonopoulos, 1995 | |
Vc | 0.2 | l/mol | N/A | Younglove and Ely, 1987 | Uncertainty assigned by TRC = 0.001 l/mol; TRC |
Vc | 0.198 | l/mol | N/A | Barber, Kay, et al., 1982 | Uncertainty assigned by TRC = 0.004 l/mol; TRC |
Vc | 0.202 | l/mol | N/A | Meyer, 1941 | Uncertainty assigned by TRC = 0.003 l/mol; TRC |
Quantity | Value | Units | Method | Reference | Comment |
ρc | 5.1 ± 0.4 | mol/l | AVG | N/A | Average of 14 out of 15 values; Individual data points |
Quantity | Value | Units | Method | Reference | Comment |
ΔvapH° | 16.25 | kJ/mol | N/A | Majer and Svoboda, 1985 |
Enthalpy of vaporization
ΔvapH (kJ/mol) | Temperature (K) | Method | Reference | Comment |
---|---|---|---|---|
18.774 | 231.04 | N/A | Kemp and Egan, 1938 | DH |
19.04 | 231.1 | N/A | Majer and Svoboda, 1985 | |
18.8 | 293. | A | Stephenson and Malanowski, 1987 | Based on data from 278. to 332. K.; AC |
19.5 | 233. | A | Stephenson and Malanowski, 1987 | Based on data from 165. to 248. K.; AC |
22.1 | 150. | A | Stephenson and Malanowski, 1987 | Based on data from 104. to 165. K.; AC |
19.0 | 266. | A | Stephenson and Malanowski, 1987 | Based on data from 231. to 281. K.; AC |
19.2 | 344. | A | Stephenson and Malanowski, 1987 | Based on data from 329. to 369. K.; AC |
18.9 | 327. | N/A | Majer, Sváb, et al., 1980 | Based on data from 312. to 367. K.; AC |
18.77 | 256. | N/A | Reid, 1972 | AC |
20.0 | 216. | N/A | Reidel, 1938 | Based on data from 166. to 231. K.; AC |
Enthalpy of vaporization
ΔvapH = A exp(-αTr)
(1 − Tr)β
ΔvapH =
Enthalpy of vaporization (at saturation pressure)
(kJ/mol)
Tr = reduced temperature (T / Tc)
View plot Requires a JavaScript / HTML 5 canvas capable browser.
Temperature (K) | 278. to 361. |
---|---|
A (kJ/mol) | 27.9 |
α | 0.0208 |
β | 0.3766 |
Tc (K) | 369.8 |
Reference | Majer and Svoboda, 1985 |
Entropy of vaporization
ΔvapS (J/mol*K) | Temperature (K) | Reference | Comment |
---|---|---|---|
81.26 | 231.04 | Kemp and Egan, 1938 | DH |
Antoine Equation Parameters
log10(P) = A − (B / (T + C))
P = vapor pressure (bar)
T = temperature (K)
View plot Requires a JavaScript / HTML 5 canvas capable browser.
Temperature (K) | A | B | C | Reference | Comment |
---|---|---|---|---|---|
277.6 to 360.8 | 4.53678 | 1149.36 | 24.906 | Helgeson and Sage, 1967 | Coefficents calculated by NIST from author's data. |
230.6 to 320.7 | 3.98292 | 819.296 | -24.417 | Rips, 1963 | Coefficents calculated by NIST from author's data. |
166.02 to 231.41 | 4.01158 | 834.26 | -22.763 | Kemp and Egan, 1938 | Coefficents calculated by NIST from author's data. |
Enthalpy of sublimation
ΔsubH (kJ/mol) | Temperature (K) | Method | Reference | Comment |
---|---|---|---|---|
28.5 | 86. | B | Bondi, 1963 | AC |
Enthalpy of fusion
ΔfusH (kJ/mol) | Temperature (K) | Method | Reference | Comment |
---|---|---|---|---|
3.51 | 85.5 | AC | Perkins, Ochoa, et al., 2009 | AC |
3.52 | 85.5 | N/A | Acree, 1991 | AC |
Temperature of phase transition
Ttrs (K) | Initial Phase | Final Phase | Reference | Comment |
---|---|---|---|---|
45.5 | crystaline | glass | Takeda, Oguni, et al., 1990 | DH |
Enthalpy of phase transition
ΔHtrs (kJ/mol) | Temperature (K) | Initial Phase | Final Phase | Reference | Comment |
---|---|---|---|---|---|
3.524 | 85.45 | crystaline, I | liquid | Kemp and Egan, 1938 | DH |
Entropy of phase transition
ΔStrs (J/mol*K) | Temperature (K) | Initial Phase | Final Phase | Reference | Comment |
---|---|---|---|---|---|
41.24 | 85.45 | crystaline, I | liquid | Kemp and Egan, 1938 | DH |

Reaction thermochemistry data

Data compiled as indicated in comments:
B - John E. Bartmess
ALS - Hussein Y. Afeefy, Joel F. Liebman, and Stephen E. Stein
M - Michael M. Meot-Ner (Mautner) and Sharon G. Lias
MS - José A. Martinho Simões
Individual Reactions
C3H7- + =
Quantity | Value | Units | Method | Reference | Comment |
---|---|---|---|---|---|
ΔrH° | 1755. ± 8.4 | kJ/mol | Bran | DePuy, Gronert, et al., 1989 | gas phase; B |
ΔrH° | 1755. ± 20. | kJ/mol | Bran | Peerboom, Rademaker, et al., 1992 | gas phase; B |
ΔrH° | 1753. ± 8.4 | kJ/mol | Bran | DePuy, Bierbaum, et al., 1984 | gas phase; B |
Quantity | Value | Units | Method | Reference | Comment |
ΔrG° | 1721. ± 8.8 | kJ/mol | H-TS | DePuy, Gronert, et al., 1989 | gas phase; B |
ΔrG° | 1722. ± 21. | kJ/mol | H-TS | Peerboom, Rademaker, et al., 1992 | gas phase; B |
Quantity | Value | Units | Method | Reference | Comment |
---|---|---|---|---|---|
ΔrH° | -123.4 ± 5.0 | kJ/mol | Chyd | Kistiakowsky and Nickle, 1951 | gas phase; Reanalyzed by Cox and Pilcher, 1970, Original value = -124.9 ± 2.1 kJ/mol; ALS |
ΔrH° | -125.0 ± 0.42 | kJ/mol | Chyd | Kistiakowsky, Ruhoff, et al., 1935 | gas phase; Reanalyzed by Cox and Pilcher, 1970, Original value = -126.00 ± 0.054 kJ/mol; At 355 °K; ALS |
By formula: H2 + C3H7F = C3H8 + HF
Quantity | Value | Units | Method | Reference | Comment |
---|---|---|---|---|---|
ΔrH° | -84.5 ± 1.3 | kJ/mol | Chyd | Lacher, Kianpour, et al., 1956 | gas phase; Reanalyzed by Cox and Pilcher, 1970, Original value = -88.3 ± 2.9 kJ/mol; %hf298_gas[kcal/mol]=-66.97±0.71; Kolesov and Kozina, 1986; ALS |
By formula: H2 + C3H7F = C3H8 + HF
Quantity | Value | Units | Method | Reference | Comment |
---|---|---|---|---|---|
ΔrH° | -92.0 ± 2.1 | kJ/mol | Chyd | Lacher, Kianpour, et al., 1956 | gas phase; Reanalyzed by Cox and Pilcher, 1970, Original value = -95.7 ± 6.7 kJ/mol; %hf298_gas[kcal/mol]=-66.71±0.62; Kolesov and Kozina, 1986; ALS |
By formula: 2H2 + C3H6Cl2 = C3H8 + 2HCl
Quantity | Value | Units | Method | Reference | Comment |
---|---|---|---|---|---|
ΔrH° | -126.5 ± 1.1 | kJ/mol | Chyd | Lacher, Amador, et al., 1967 | gas phase; Reanalyzed by Cox and Pilcher, 1970, Original value = -130.60 ± 0.54 kJ/mol; At 250 C; ALS |
Quantity | Value | Units | Method | Reference | Comment |
---|---|---|---|---|---|
ΔrH° | -289.6 ± 0.63 | kJ/mol | Chyd | Conn, Kistiakowsky, et al., 1939 | gas phase; Reanalyzed by Cox and Pilcher, 1970, Original value = -288.8 ± 0.59 kJ/mol; At 355 K; ALS |
Quantity | Value | Units | Method | Reference | Comment |
---|---|---|---|---|---|
ΔrH° | -295.1 ± 1.0 | kJ/mol | Chyd | Kistiakowsky, Ruhoff, et al., 1936 | gas phase; Reanalyzed by Cox and Pilcher, 1970, Original value = -298.2 ± 0.84 kJ/mol; At 355 °K; ALS |
By formula: H2 + C3H7Br = HBr + C3H8
Quantity | Value | Units | Method | Reference | Comment |
---|---|---|---|---|---|
ΔrH° | -45.40 ± 0.92 | kJ/mol | Chyd | Davies, Lacher, et al., 1965 | gas phase; Reanalyzed by Cox and Pilcher, 1970, Original value = -45.06 kJ/mol; ALS |
Quantity | Value | Units | Method | Reference | Comment |
---|---|---|---|---|---|
ΔrH° | 1739. ± 8.4 | kJ/mol | Bran | DePuy, Gronert, et al., 1989 | gas phase; B |
Quantity | Value | Units | Method | Reference | Comment |
ΔrG° | 1704. ± 8.8 | kJ/mol | H-TS | DePuy, Gronert, et al., 1989 | gas phase; B |
By formula: C3H7+ + C3H8 = (C3H7+ • C3H8)
Quantity | Value | Units | Method | Reference | Comment |
---|---|---|---|---|---|
ΔrH° | 56.9 | kJ/mol | PHPMS | Sunner, Hirao, et al., 1989 | gas phase; M |
Quantity | Value | Units | Method | Reference | Comment |
ΔrS° | 123. | J/mol*K | PHPMS | Sunner, Hirao, et al., 1989 | gas phase; M |
By formula: C4H9+ + C3H8 = (C4H9+ • C3H8)
Quantity | Value | Units | Method | Reference | Comment |
---|---|---|---|---|---|
ΔrH° | 28. | kJ/mol | PHPMS | Sunner, Hirao, et al., 1989 | gas phase; M |
Quantity | Value | Units | Method | Reference | Comment |
ΔrS° | 93.3 | J/mol*K | PHPMS | Sunner, Hirao, et al., 1989 | gas phase; M |
By formula: Fe+ + C3H8 = (Fe+ • C3H8)
Enthalpy of reaction
ΔrH° (kJ/mol) | T (K) | Method | Reference | Comment |
---|---|---|---|---|
74.9 (+4.2,-0.) | CID | Armentrout and Kickel, 1994 | gas phase; guided ion beam CID; M |
By formula: Co+ + C3H8 = (Co+ • C3H8)
Enthalpy of reaction
ΔrH° (kJ/mol) | T (K) | Method | Reference | Comment |
---|---|---|---|---|
129. (+5.9,-0.) | CID | Armentrout and Kickel, 1994 | gas phase; guided ion beam CID; M |
C3H7BrMg (solution) + (g) =
(solution) + Br2Mg (solution)
By formula: C3H7BrMg (solution) + HBr (g) = C3H8 (solution) + Br2Mg (solution)
Quantity | Value | Units | Method | Reference | Comment |
---|---|---|---|---|---|
ΔrH° | -305.9 ± 2.2 | kJ/mol | RSC | Holm, 1981 | solvent: Diethyl ether; MS |
By formula: C5O5W (g) + C3H8 (g) = C8H8O5W (g)
Quantity | Value | Units | Method | Reference | Comment |
---|---|---|---|---|---|
ΔrH° | -33.9 ± 8.4 | kJ/mol | EqG | Brown, Ishikawa, et al., 1990 | Temperature range: ca. 300-350 K; MS |
By formula: H2 + C3H7Cl = C3H8 + HCl
Quantity | Value | Units | Method | Reference | Comment |
---|---|---|---|---|---|
ΔrH° | -65.81 ± 0.67 | kJ/mol | Chyd | Davies, Lacher, et al., 1965 | gas phase; ALS |
By formula: H2 + C3H7Cl = C3H8 + HCl
Quantity | Value | Units | Method | Reference | Comment |
---|---|---|---|---|---|
ΔrH° | -58.32 ± 0.71 | kJ/mol | Chyd | Davies, Lacher, et al., 1965 | gas phase; ALS |
By formula: C3H7Br + H2 = HBr + C3H8
Quantity | Value | Units | Method | Reference | Comment |
---|---|---|---|---|---|
ΔrH° | -56.78 | kJ/mol | Chyd | Davies, Lacher, et al., 1965 | gas phase; ALS |

Gas phase ion energetics data

Data evaluated as indicated in comments:
HL - Edward P. Hunter and Sharon G. Lias
L - Sharon G. Lias
Data compiled as indicated in comments:
B - John E. Bartmess
LL - Sharon G. Lias and Joel F. Liebman
LLK - Sharon G. Lias, Rhoda D. Levin, and Sherif A. Kafafi
RDSH - Henry M. Rosenstock, Keith Draxl, Bruce W. Steiner, and John T. Herron
LBLHLM - Sharon G. Lias, John E. Bartmess, Joel F. Liebman, John L. Holmes, Rhoda D. Levin, and W. Gary Mallard
Quantity | Value | Units | Method | Reference | Comment |
---|---|---|---|---|---|
IE (evaluated) | 10.94 ± 0.05 | eV | N/A | N/A | L |
Quantity | Value | Units | Method | Reference | Comment |
Proton affinity (review) | 625.7 | kJ/mol | N/A | Hunter and Lias, 1998 | HL |
Quantity | Value | Units | Method | Reference | Comment |
Gas basicity | 607.8 | kJ/mol | N/A | Hunter and Lias, 1998 | HL |
Ionization energy determinations
IE (eV) | Method | Reference | Comment |
---|---|---|---|
11. ± 1. | PI | Au, Cooper, et al., 1993 | LL |
10.96 | EST | Luo and Pacey, 1992 | LL |
10.9 ± 0.1 | PE | Bieri, Burger, et al., 1977 | LLK |
11.27 ± 0.05 | EI | Flesch and Svec, 1973 | LLK |
11.01 ± 0.07 | EI | Finney and Harrison, 1972 | LLK |
10.94 ± 0.05 | TE | Stockbauer and Inghram, 1971 | LLK |
10.97 | PI | Vlaskov and Ovchinnikov, 1969 | RDSH |
11.06 | PE | Dewar and Worley, 1969 | RDSH |
11.09 ± 0.05 | EI | Williams and Hamill, 1968 | RDSH |
11.12 | CI | Cermak, 1968 | RDSH |
10.95 ± 0.05 | PI | Chupka and Berkowitz, 1967 | RDSH |
11.22 | EI | Lifshitz and Shapiro, 1966 | RDSH |
11.07 | PE | Turner and Al-Joboury, 1964 | RDSH |
11.07 | PE | Al-Joboury and Turner, 1964 | RDSH |
11.51 | PE | Kimura, Katsumata, et al., 1981 | Vertical value; LLK |
11.5 | PE | Bieri and Asbrink, 1980 | Vertical value; LLK |
11.5 ± 0.1 | PE | Bieri, Burger, et al., 1977 | Vertical value; LLK |
11.5 | PE | Murrell and Schmidt, 1972 | Vertical value; LLK |
Appearance energy determinations
De-protonation reactions
C3H7- + =
Quantity | Value | Units | Method | Reference | Comment |
---|---|---|---|---|---|
ΔrH° | 1755. ± 8.4 | kJ/mol | Bran | DePuy, Gronert, et al., 1989 | gas phase; B |
ΔrH° | 1755. ± 20. | kJ/mol | Bran | Peerboom, Rademaker, et al., 1992 | gas phase; B |
ΔrH° | 1753. ± 8.4 | kJ/mol | Bran | DePuy, Bierbaum, et al., 1984 | gas phase; B |
Quantity | Value | Units | Method | Reference | Comment |
ΔrG° | 1721. ± 8.8 | kJ/mol | H-TS | DePuy, Gronert, et al., 1989 | gas phase; B |
ΔrG° | 1722. ± 21. | kJ/mol | H-TS | Peerboom, Rademaker, et al., 1992 | gas phase; B |
Quantity | Value | Units | Method | Reference | Comment |
---|---|---|---|---|---|
ΔrH° | 1739. ± 8.4 | kJ/mol | Bran | DePuy, Gronert, et al., 1989 | gas phase; B |
Quantity | Value | Units | Method | Reference | Comment |
ΔrG° | 1704. ± 8.8 | kJ/mol | H-TS | DePuy, Gronert, et al., 1989 | gas phase; B |

Ion clustering data

Data compiled by: Michael M. Meot-Ner (Mautner) and Sharon G. Lias
Clustering reactions
By formula: C3H7+ + C3H8 = (C3H7+ • C3H8)
Quantity | Value | Units | Method | Reference | Comment |
---|---|---|---|---|---|
ΔrH° | 56.9 | kJ/mol | PHPMS | Sunner, Hirao, et al., 1989 | gas phase |
Quantity | Value | Units | Method | Reference | Comment |
ΔrS° | 123. | J/mol*K | PHPMS | Sunner, Hirao, et al., 1989 | gas phase |
By formula: C4H9+ + C3H8 = (C4H9+ • C3H8)
Quantity | Value | Units | Method | Reference | Comment |
---|---|---|---|---|---|
ΔrH° | 28. | kJ/mol | PHPMS | Sunner, Hirao, et al., 1989 | gas phase |
Quantity | Value | Units | Method | Reference | Comment |
ΔrS° | 93.3 | J/mol*K | PHPMS | Sunner, Hirao, et al., 1989 | gas phase |
By formula: Co+ + C3H8 = (Co+ • C3H8)
Enthalpy of reaction
ΔrH° (kJ/mol) | T (K) | Method | Reference | Comment |
---|---|---|---|---|
129. (+5.9,-0.) | CID | Armentrout and Kickel, 1994 | gas phase; guided ion beam CID |
By formula: Fe+ + C3H8 = (Fe+ • C3H8)
Enthalpy of reaction
ΔrH° (kJ/mol) | T (K) | Method | Reference | Comment |
---|---|---|---|---|
74.9 (+4.2,-0.) | CID | Armentrout and Kickel, 1994 | gas phase; guided ion beam CID |

Henry's Law data

Data compiled by: Rolf Sander
Henry's Law constant (water solution)
kH(T) = k°H exp(d(ln(kH))/d(1/T) ((1/T) - 1/(298.15 K)))
k°H = Henry's law constant for solubility in water at 298.15 K (mol/(kg*bar))
d(ln(kH))/d(1/T) = Temperature dependence constant (K)
k°H (mol/(kg*bar)) | d(ln(kH))/d(1/T) (K) | Method | Reference | Comment |
---|---|---|---|---|
0.0015 | 2700. | L | N/A | |
0.0014 | Q | N/A | missing citation give several references for the Henry's law constants but don't assign them to specific species. | |
0.0014 | L | N/A | ||
0.0015 | 2700. | L | N/A | |
0.0014 | V | N/A |

References

Pittam and Pilcher, 1972
Pittam, D.A.; Pilcher, G.,
Measurements of heats of combustion by flame calorimetry. Part 8.-Methane, ethane, propane, n-butane and 2-methylpropane,
J. Chem. Soc. Faraday Trans. 1, 1972, 68, 2224-2229. [all data]
Prosen and Rossini, 1945
Prosen, E.J.; Rossini, F.D.,
Heats of combustion and formation of the paraffin hydrocarbons at 25° C,
J. Res. NBS, 1945, 263-267. [all data]
Rossini, 1934
Rossini, F.D.,
Calorimetric determination of the heats of combustion of ethane, propane, normal butane, and normal pentane,
J. Res. NBS, 1934, 12, 735-750. [all data]
Guinchant, 1918
Guinchant, M.J.,
Etude sur la fonction acide dans les derives metheniques et methiniques,
Ann. Chem., 1918, 10, 30-84. [all data]
Chao J., 1973
Chao J.,
Ideal gas thermodynamic properties of ethane and propane,
J. Phys. Chem. Ref. Data, 1973, 2, 427-438. [all data]
Pitzer K.S., 1944
Pitzer K.S.,
Thermodynamics of gaseous paraffins. Specific heat and related properties,
Ind. Eng. Chem., 1944, 36, 829-831. [all data]
Ernst G., 1970
Ernst G.,
Ideal and real gas state heat capacities Cp of C3H8, i-C4H10, C2F5Cl, CH2ClCF3, CF2ClCFCl2, and CHF2Cl,
J. Chem. Thermodyn., 1970, 2, 787-791. [all data]
Kistiakowsky G.B., 1940
Kistiakowsky G.B.,
The low temperature gaseous heat capacities of certain C3 hydrocarbons,
J. Chem. Phys., 1940, 8, 970-977. [all data]
Kistiakowsky G.B., 1940, 2
Kistiakowsky G.B.,
Gaseous heat capacities. II,
J. Chem. Phys., 1940, 8, 610-618. [all data]
Dailey B.P., 1943
Dailey B.P.,
The heat capacities at higher temperatures of ethane and propane,
J. Am. Chem. Soc., 1943, 65, 42-44. [all data]
Kemp and Egan, 1938
Kemp, J.D.; Egan, C.J.,
Hindered rotation of the methyl groups in propane. The heat capacity, vapor pressure, heats of fusion and vaporization of propane. Entropy and density of the gas,
J. Am. Chem. Soc., 1938, 60, 1521-1525. [all data]
Vas'kov, 1982
Vas'kov, E.T.,
Heat capacity of propane,
Deposited Doc., 1982, VINITI 1728-82, 1-15. [all data]
Goodwin, 1978
Goodwin, R.D.,
Specific heats of saturated and compressed liquid propane,
J. Res., 1978, NBS 83, 449-458. [all data]
Streng, 1971
Streng, A.G.,
Miscibility and Compatibility of Some Liquid and Solidified Gases at Low Temperature,
J. Chem. Eng. Data, 1971, 16, 357. [all data]
Klipping and Schmidt, 1965
Klipping, G.; Schmidt, F.,
Temperature Measurement with the Vapor Pressure Thermometer,
Kaeltetechnik, 1965, 17, 382-4. [all data]
Harteck and Edse, 1938
Harteck, P.; Edse, R.,
Vapor-pressure Measurement of Propane,
Z. Phys. Chem., Abt. A, 1938, 182, 220. [all data]
Hicks-Brunn and Bruun, 1936
Hicks-Brunn, M.M.; Bruun, J.H.,
The Freezing and Boiling Point of Propane,
J. Am. Chem. Soc., 1936, 58, 810-2. [all data]
Timmermans, 1921
Timmermans, J.,
The Freezing Points of Organic Substances IV. New Exp. Determinations,
Bull. Soc. Chim. Belg., 1921, 30, 62. [all data]
Younglove and Ely, 1987
Younglove, B.A.; Ely, J.F.,
Thermophysical Properties of Fluids II. Methane, Ethane, Propane, Isobutane, and Normal Butane,
J. Phys. Chem. Ref. Data, 1987, 16, 577. [all data]
Goodwin and Haynes, 1982
Goodwin, R.D.; Haynes, W.M.,
Thermophysical Properties of Propane from 85 to 700 K at Pressures to 70 MPa, NBS Monogr. (U. S.) No. 170, 249 pp., 1982. [all data]
Ambrose and Tsonopoulos, 1995
Ambrose, D.; Tsonopoulos, C.,
Vapor-Liquid Critical Properties of Elements and Compounds. 2. Normal Alkenes,
J. Chem. Eng. Data, 1995, 40, 531-546. [all data]
Barber, Kay, et al., 1982
Barber, J.R.; Kay, W.B.; Teja, A.S.,
A study of the volumetric and phase behavior of binary systems: part I. critical properties of propane + perfluorocyclobutane mixtures.,
AIChE J., 1982, 28, 134-8. [all data]
Meyer, 1941
Meyer, R.E.,
, Ph.D. Thesis, Penn. State Univ., Univ. Park, PA, 1941. [all data]
Majer and Svoboda, 1985
Majer, V.; Svoboda, V.,
Enthalpies of Vaporization of Organic Compounds: A Critical Review and Data Compilation, Blackwell Scientific Publications, Oxford, 1985, 300. [all data]
Stephenson and Malanowski, 1987
Stephenson, Richard M.; Malanowski, Stanislaw,
Handbook of the Thermodynamics of Organic Compounds, 1987, https://doi.org/10.1007/978-94-009-3173-2
. [all data]
Majer, Sváb, et al., 1980
Majer, V.; Sváb, L.; Svoboda, V.,
Enthalpies of vaporization and cohesive energies for a group of chlorinated hydrocarbons,
The Journal of Chemical Thermodynamics, 1980, 12, 9, 843-847, https://doi.org/10.1016/0021-9614(80)90028-2
. [all data]
Reid, 1972
Reid, Robert C.,
Handbook on vapor pressure and heats of vaporization of hydrocarbons and related compounds, R. C. Wilhort and B. J. Zwolinski, Texas A Research Foundation. College Station, Texas(1971). 329 pages.$10.00,
AIChE J., 1972, 18, 6, 1278-1278, https://doi.org/10.1002/aic.690180637
. [all data]
Reidel, 1938
Reidel, L.,
Z. Ges. Kalte-Ind., 1938, 45, 221. [all data]
Helgeson and Sage, 1967
Helgeson, N.L.; Sage, B.H.,
Latent Heat of Vaporization of Propane,
J. Chem. Eng. Data, 1967, 12, 1, 47-49, https://doi.org/10.1021/je60032a015
. [all data]
Rips, 1963
Rips, S.M.,
On a Feasible Level of Filling in of Reservoires by Liquid Hydrocarbons,
Khim. Prom. (Moscow), 1963, 8, 610-613. [all data]
Bondi, 1963
Bondi, A.,
Heat of Siblimation of Molecular Crystals: A Catalog of Molecular Structure Increments.,
J. Chem. Eng. Data, 1963, 8, 3, 371-381, https://doi.org/10.1021/je60018a027
. [all data]
Perkins, Ochoa, et al., 2009
Perkins, Richard A.; Ochoa, Jesus C. Sanchez; Magee, Joseph W.,
Thermodynamic Properties of Propane. II. Molar Heat Capacity at Constant Volume from (85 to 345) K with Pressures to 35 MPa,
J. Chem. Eng. Data, 2009, 54, 12, 3192-3201, https://doi.org/10.1021/je900137r
. [all data]
Acree, 1991
Acree, William E.,
Thermodynamic properties of organic compounds: enthalpy of fusion and melting point temperature compilation,
Thermochimica Acta, 1991, 189, 1, 37-56, https://doi.org/10.1016/0040-6031(91)87098-H
. [all data]
Takeda, Oguni, et al., 1990
Takeda, K.; Oguni, M.; Suga, H.,
A DTA apparatus for vapour-deposited samples. Characterisation of some vapour-deposited hydrocarbons,
Thermochim. Acta, 1990, 158(1), 195-203. [all data]
DePuy, Gronert, et al., 1989
DePuy, C.H.; Gronert, S.; Barlow, S.E.; Bierbaum, V.M.; Damrauer, R.,
The Gas Phase Acidities of the Alkanes,
J. Am. Chem. Soc., 1989, 111, 6, 1968, https://doi.org/10.1021/ja00188a003
. [all data]
Peerboom, Rademaker, et al., 1992
Peerboom, R.A.L.; Rademaker, G.J.; Dekoning, L.J.; Nibbering, N.M.M.,
Stabilization of Cycloalkyl Carbanions in the Gas Phase,
Rapid Commun. Mass Spectrom., 1992, 6, 6, 394, https://doi.org/10.1002/rcm.1290060608
. [all data]
DePuy, Bierbaum, et al., 1984
DePuy, C.H.; Bierbaum, V.M.; Damrauer, R.,
Relative Gas-Phase Acidities of the Alkanes,
J. Am. Chem. Soc., 1984, 106, 4051. [all data]
Kistiakowsky and Nickle, 1951
Kistiakowsky, G.B.; Nickle, A.G.,
Ethane-ethylene and propane-propylene equilibria,
Faraday Discuss. Chem. Soc., 1951, 10, 175-187. [all data]
Cox and Pilcher, 1970
Cox, J.D.; Pilcher, G.,
Thermochemistry of Organic and Organometallic Compounds, Academic Press, New York, 1970, 1-636. [all data]
Kistiakowsky, Ruhoff, et al., 1935
Kistiakowsky, G.B.; Ruhoff, J.R.; Smith, H.A.; Vaughan, W.E.,
Heats of organic reactions. II. Hydrogenation of some simpler olefinic hydrocarbons,
J. Am. Chem. Soc., 1935, 57, 876-882. [all data]
Lacher, Kianpour, et al., 1956
Lacher, J.R.; Kianpour, A.; Park, J.D.,
Reaction heats of organic halogen compounds. VI. The catalytic hydrogenation of some alkyl fluorides,
J. Phys. Chem., 1956, 60, 1454-1455. [all data]
Kolesov and Kozina, 1986
Kolesov, V.P.; Kozina, M.P.,
Thermochemistry of organic and organohalogen compounds,
Russ. Chem. Rev., 1986, 55, 912. [all data]
Lacher, Amador, et al., 1967
Lacher, J.R.; Amador, A.; Park, J.D.,
Reaction heats of organic compounds. Part 5.-Heats of hydrogenation of dichloromethane, 1,1- and 1,2-dichloroethane and 1,2-dichloropropane,
Trans. Faraday Soc., 1967, 63, 1608-1611. [all data]
Conn, Kistiakowsky, et al., 1939
Conn, J.B.; Kistiakowsky, G.B.; Smith, E.A.,
Heats of organic reactions. VIII. Some further hydrogenations, including those of some acetylenes,
J. Am. Chem. Soc., 1939, 61, 1868-1876. [all data]
Kistiakowsky, Ruhoff, et al., 1936
Kistiakowsky, G.B.; Ruhoff, J.R.; Smith, H.A.; Vaughan, W.E.,
Heats of organic reactions. IV. Hydrogenation of some dienes and of benzene,
J. Am. Chem. Soc., 1936, 58, 146-153. [all data]
Davies, Lacher, et al., 1965
Davies, J.; Lacher, J.R.; Park, J.D.,
Reaction heats of organic compounds. Part 4.-Heats of hydrogenation of n- and iso-Propyl bromides and chlorides,
Trans. Faraday Soc., 1965, 61, 2413-2416. [all data]
Sunner, Hirao, et al., 1989
Sunner, J.A.; Hirao, K.; Kebarle, P.,
Hydride - Transfer Reactions. Temperature Dependence of Rate Constants for i-C3H7+ + HC(CH3)3 = C3H8 + C(CH3)3+. Clusters of i-C3H7+ and t-C4H9+ with Propane and Isobutane,
J. Phys. Chem., 1989, 93, 10, 4010, https://doi.org/10.1021/j100347a030
. [all data]
Armentrout and Kickel, 1994
Armentrout, P.B.; Kickel, B.L.,
Gas Phase Thermochemistry of Transition Metal Ligand Systems: Reassessment of Values and Periodic Trends, in Organometallic Ion Chemistry, B. S. Freiser, ed, 1994. [all data]
Holm, 1981
Holm, T.,
J. Chem. Soc., Perkin Trans. II, 1981, 464.. [all data]
Brown, Ishikawa, et al., 1990
Brown, C.E.; Ishikawa, Y.; Hackett, P.A.; Rayner, D.M.,
J. Am. Chem. Soc., 1990, 112, 2530. [all data]
Hunter and Lias, 1998
Hunter, E.P.; Lias, S.G.,
Evaluated Gas Phase Basicities and Proton Affinities of Molecules: An Update,
J. Phys. Chem. Ref. Data, 1998, 27, 3, 413-656, https://doi.org/10.1063/1.556018
. [all data]
Au, Cooper, et al., 1993
Au, J.W.; Cooper, G.; Brion, C.E.,
The molecular and dissociative photoionization of ethane, propane, and n-butane: Absolute oscillator strengths (10-80 eV) and breakdown pathways,
Chem. Phys., 1993, 173, 241. [all data]
Luo and Pacey, 1992
Luo, Y.-R.; Pacey, P.D.,
Effects of alkyl substitution on ionization energies of alkanes and haloalkanes and on heats of formation of their molecular cations. Part 2. Alkanes and chloro-, bromo- and iodoalkanes,
Int. J. Mass Spectrom. Ion Processes, 1992, 112, 63. [all data]
Bieri, Burger, et al., 1977
Bieri, G.; Burger, F.; Heilbronner, E.; Maier, J.P.,
Valence ionization enrgies of hydrocarbons,
Helv. Chim. Acta, 1977, 60, 2213. [all data]
Flesch and Svec, 1973
Flesch, G.D.; Svec, H.J.,
Fragmentation reactions in the mass spectrometer for C2-C5 alkanes,
J. Chem. Soc. Faraday Trans. 2, 1973, 69, 1187. [all data]
Finney and Harrison, 1972
Finney, C.D.; Harrison, A.G.,
A third-derivative method for determining electron-impact onset potentials,
Int. J. Mass Spectrom. Ion Phys., 1972, 9, 221. [all data]
Stockbauer and Inghram, 1971
Stockbauer, R.; Inghram, M.G.,
Experimental relative Franck-Condon factors for the ionization of methane, ethane, and propane,
J. Chem. Phys., 1971, 54, 2242. [all data]
Vlaskov and Ovchinnikov, 1969
Vlaskov, V.A.; Ovchinnikov, A.A.,
The temperature dependence of the photoionization cross-section of polyatomic molecules,
Opt. i Spektroskopiya, 1969, 27, 748, In original 408. [all data]
Dewar and Worley, 1969
Dewar, M.J.S.; Worley, S.D.,
Photoelectron spectra of molecules. I. Ionization potentials of some organic molecules and their interpretation,
J. Chem. Phys., 1969, 50, 654. [all data]
Williams and Hamill, 1968
Williams, J.M.; Hamill, W.H.,
Ionization potentials of molecules and free radicals and appearance potentials by electron impact in the mass spectrometer,
J. Chem. Phys., 1968, 49, 4467. [all data]
Cermak, 1968
Cermak, V.,
Penning ionization electron spectroscopy. I. Determination of ionization potentials of polyatomic molecules,
Collection Czech. Chem. Commun., 1968, 33, 2739. [all data]
Chupka and Berkowitz, 1967
Chupka, W.A.; Berkowitz, J.,
Photoionization of ethane, propane, and n-butane with mass analysis,
J. Chem. Phys., 1967, 47, 2921. [all data]
Lifshitz and Shapiro, 1966
Lifshitz, C.; Shapiro, M.,
Isotope effects on metastable transitions: C3H8 and C3D8,
J. Chem. Phys., 1966, 45, 4242. [all data]
Turner and Al-Joboury, 1964
Turner, D.W.; Al-Joboury, M.I.,
Molecular photoelectron spectroscopy,
Bull. Soc. Chim. Belges, 1964, 73, 428. [all data]
Al-Joboury and Turner, 1964
Al-Joboury, M.I.; Turner, D.W.,
Molecular photoelectron spectroscopy. Part II. A summary of ionization potentials,
J. Chem. Soc., 1964, 4434. [all data]
Kimura, Katsumata, et al., 1981
Kimura, K.; Katsumata, S.; Achiba, Y.; Yamazaki, T.; Iwata, S.,
Ionization energies, Ab initio assignments, and valence electronic structure for 200 molecules
in Handbook of HeI Photoelectron Spectra of Fundamental Organic Compounds, Japan Scientific Soc. Press, Tokyo, 1981. [all data]
Bieri and Asbrink, 1980
Bieri, G.; Asbrink, L.,
30.4-nm He(II) photoelectron spectra of organic molecules,
J. Electron Spectrosc. Relat. Phenom., 1980, 20, 149. [all data]
Murrell and Schmidt, 1972
Murrell, J.N.; Schmidt, W.,
Photoelectron spectroscopic correlation of the molecular orbitals of methane, ethane, propane, isobutane and neopentane,
J. Chem. Soc. Faraday Trans. 2, 1972, 68, 1709. [all data]
Ehrhardt and Tekaat, 1964
Ehrhardt, H.; Tekaat, T.,
Auftrittspotentialmessungen an ionisierten Molekulbruchstucken mit kinetischer Anfangsenergie,
Z. Naturforsch., 1964, 19a, 1382. [all data]
Fuchs, 1972
Fuchs, R.,
Die kinetische energie ionisierter molekulfragmente VII. H3 ALS fragmention bei der elektronenstrossionisierung von kohlenwasserstoffen,
Int. J. Mass Spectrom. Ion Processes, 1972, 8, 193. [all data]
Appell, Durup, et al., 1966
Appell, J.; Durup, J.; Heitz, F.,
Sur le seuil d'apparition des ions fragments produits avec exces d'energie cinetique,
Advan. Mass Spectrom., 1966, 3, 457. [all data]
Gilman, Hsieh, et al., 1982
Gilman, J.P.; Hsieh, T.; Meisels, G.G.,
Carbon skeletal rearrangement of the propane ion,
J. Chem. Phys., 1982, 76, 3497. [all data]
Wolkoff and Holmes, 1978
Wolkoff, P.; Holmes, J.L.,
Fragmentations of alkane molecular ions,
J. Am. Chem. Soc., 1978, 100, 7346. [all data]
Hickling and Jennings, 1970
Hickling, R.D.; Jennings, K.R.,
Kinetic shifts and metastable transitions,
Org. Mass Spectrom., 1970, 3, 1499. [all data]
Omura, 1961
Omura, I.,
Mass spectra at low ionizing voltage and bond dissociation energies of molecular ions from hydrocarbons,
Bull. Chem. Soc. Japan, 1961, 34, 1227. [all data]
Steiner, Giese, et al., 1961
Steiner, B.; Giese, C.F.; Inghram, M.G.,
Photoionization of alkanes. Dissociation of excited molecular ions,
J. Chem. Phys., 1961, 34, 189. [all data]