Methane, dibromo-
- Formula: CH2Br2
- Molecular weight: 173.835
- IUPAC Standard InChIKey: FJBFPHVGVWTDIP-UHFFFAOYSA-N
- CAS Registry Number: 74-95-3
- Chemical structure:
View 3d structure (requires JavaScript / HTML 5) - Other names: Dibromomethane; Methylene bromide; Methylene dibromide; CH2Br2; Rcra waste number U068; UN 2664

Condensed phase thermochemistry data

Data compiled by: Eugene S. Domalski and Elizabeth D. Hearing
Constant pressure heat capacity of liquid
Cp,liquid (J/mol*K) | Temperature (K) | Reference | Comment |
---|---|---|---|
104.1 | 298.15 | Shehatta, 1993 | |
105.3 | 300. | Harrison and Moelwyn-Hughes, 1957 | T = 243 to 303 K. |
127.2 | 298. | Kurbatov, 1948 | T = -22 to 98°C. Mean Cp, four temperatures. |

Phase change data

Data compiled as indicated in comments:
TRC - Thermodynamics Research Center, NIST Boulder Laboratories, Chris Muzny director
ALS - Hussein Y. Afeefy, Joel F. Liebman, and Stephen E. Stein
AC - William E. Acree, Jr., James S. Chickos
Quantity | Value | Units | Method | Reference | Comment |
---|---|---|---|---|---|
Tboil | 370. ± 1. | K | AVG | N/A | Average of 6 values; Individual data points |
Quantity | Value | Units | Method | Reference | Comment |
Tfus | 220.45 | K | N/A | Timmermans, 1952 | Uncertainty assigned by TRC = 0.5 K; TRC |
Tfus | 220.63 | K | N/A | Timmermans, 1921 | Uncertainty assigned by TRC = 0.2 K; TRC |
Quantity | Value | Units | Method | Reference | Comment |
ΔvapH° | 37.03 | kJ/mol | N/A | Majer and Svoboda, 1985 | |
ΔvapH° | 36.97 ± 0.10 | kJ/mol | C | Laynez and Wadso, 1972 | ALS |
ΔvapH° | 37.0 ± 0.1 | kJ/mol | A,E | Laynez, Wadsö, et al., 1972 | AC |
Enthalpy of vaporization
ΔvapH (kJ/mol) | Temperature (K) | Method | Reference | Comment |
---|---|---|---|---|
32.92 | 370.1 | N/A | Majer and Svoboda, 1985 | |
36.5 | 288. | C | Kudchadker, Kudchadker, et al., 1979 | Based on data from 273. to 373. K.; AC |
37.8 | 253. | N/A | Stull, 1947 | Based on data from 238. to 371. K.; AC |
Antoine Equation Parameters
log10(P) = A − (B / (T + C))
P = vapor pressure (bar)
T = temperature (K)
View plot Requires a JavaScript / HTML 5 canvas capable browser.
Temperature (K) | A | B | C | Reference | Comment |
---|---|---|---|---|---|
238.1 to 371.8 | 4.51734 | 1546.096 | -28.977 | Stull, 1947 | Coefficents calculated by NIST from author's data. |

Reaction thermochemistry data

Data compiled as indicated in comments:
B - John E. Bartmess
MS - José A. Martinho Simões
Individual Reactions
CHBr2- + =
By formula: CHBr2- + H+ = CH2Br2
Quantity | Value | Units | Method | Reference | Comment |
---|---|---|---|---|---|
ΔrH° | 1544. ± 13. | kJ/mol | G+TS | Born, Ingemann, et al., 2000 | gas phase; B |
Quantity | Value | Units | Method | Reference | Comment |
ΔrG° | 1512. ± 13. | kJ/mol | IMRB | Born, Ingemann, et al., 2000 | gas phase; B |
C14H21MnO2 (solution) + (solution) = C8H7Br2MnO2 (solution) +
(solution)
By formula: C14H21MnO2 (solution) + CH2Br2 (solution) = C8H7Br2MnO2 (solution) + C7H16 (solution)
Quantity | Value | Units | Method | Reference | Comment |
---|---|---|---|---|---|
ΔrH° | -51.0 ± 5.0 | kJ/mol | PAC | Yang and Yang, 1992 | solvent: Heptane; MS |

Henry's Law data

Data compiled by: Rolf Sander
Henry's Law constant (water solution)
kH(T) = k°H exp(d(ln(kH))/d(1/T) ((1/T) - 1/(298.15 K)))
k°H = Henry's law constant for solubility in water at 298.15 K (mol/(kg*bar))
d(ln(kH))/d(1/T) = Temperature dependence constant (K)
k°H (mol/(kg*bar)) | d(ln(kH))/d(1/T) (K) | Method | Reference |
---|---|---|---|
0.93 | 4400. | M | N/A |
1.1 | 4000. | X | N/A |
1.1 | 3900. | M | N/A |
1.1 | 3700. | X | N/A |
3.2 | L | N/A | |
1.1 | V | N/A |

Gas phase ion energetics data

Data evaluated as indicated in comments:
L - Sharon G. Lias
Data compiled as indicated in comments:
B - John E. Bartmess
LL - Sharon G. Lias and Joel F. Liebman
LBLHLM - Sharon G. Lias, John E. Bartmess, Joel F. Liebman, John L. Holmes, Rhoda D. Levin, and W. Gary Mallard
LLK - Sharon G. Lias, Rhoda D. Levin, and Sherif A. Kafafi
RDSH - Henry M. Rosenstock, Keith Draxl, Bruce W. Steiner, and John T. Herron
Quantity | Value | Units | Method | Reference | Comment |
---|---|---|---|---|---|
IE (evaluated) | 10.41 ± 0.13 | eV | N/A | N/A | L |
Ionization energy determinations
IE (eV) | Method | Reference | Comment |
---|---|---|---|
10.24 ± 0.02 | PI | Ma, Liao, et al., 1993 | LL |
10.5 ± 0.1 | EI | Kaposi, Riedel, et al., 1976 | LLK |
10.52 ± 0.05 | PI | Tsai, Baer, et al., 1975 | LLK |
10.49 ± 0.02 | PI | Watanabe, Nakayama, et al., 1962 | RDSH |
10.6 | PE | Von Niessen, Asbrink, et al., 1982 | Vertical value; LBLHLM |
9.78 | PE | Wittel and Bock, 1974 | Vertical value; LLK |
10.61 | PE | Dixon, Murrell, et al., 1971 | Vertical value; LLK |
10.61 | PE | Potts, Lempka, et al., 1970 | Vertical value; RDSH |
Appearance energy determinations
Ion | AE (eV) | Other Products | Method | Reference | Comment |
---|---|---|---|---|---|
Br+ | 15.5 ± 0.1 | CH2Br | EI | DeCorpo, Bafus, et al., 1971 | LLK |
Br+ | 16.0 | CH2Br | EI | Franklin and Haney, 1970 | RDSH |
HBr+ | 18.2 ± 0.2 | ? | EI | Kaposi, Riedel, et al., 1976 | LLK |
Br2+ | 20.7 ± 0.5 | ? | EI | Kaposi, Riedel, et al., 1976 | LLK |
C+ | 22.7 ± 0.5 | ? | EI | Kaposi, Riedel, et al., 1976 | LLK |
C+ | 24.52 ± 0.05 | ? | EI | Reed and Snedden, 1956 | RDSH |
CBr+ | 19.6 ± 0.3 | ? | EI | Kaposi, Riedel, et al., 1976 | LLK |
CBr2+ | 15.6 ± 0.5 | ? | EI | Kaposi, Riedel, et al., 1976 | LLK |
CH+ | 22.0 ± 0.5 | ? | EI | Kaposi, Riedel, et al., 1976 | LLK |
CH+ | 21.55 ± 0.05 | ? | EI | Reed and Snedden, 1956 | RDSH |
CHBr+ | 16.0 ± 0.5 | ? | EI | Kaposi, Riedel, et al., 1976 | LLK |
CH2+ | 17.1 ± 0.3 | ? | EI | Kaposi, Riedel, et al., 1976 | LLK |
CH2Br+ | 11.27 | Br | PI | Ma, Liao, et al., 1993 | LL |
CH2Br+ | 11.29 | Br | EI | Holmes, Lossing, et al., 1988 | LL |
CH2Br+ | 11.1 ± 0.2 | Br | EI | Kaposi, Riedel, et al., 1976 | LLK |
CH2Br+ | 11.35 ± 0.02 | Br | PI | Tsai, Baer, et al., 1975 | LLK |
CH2Br+ | 10.93 ± 0.04 | Br | EI | Reed and Snedden, 1956 | RDSH |
De-protonation reactions
CHBr2- + =
By formula: CHBr2- + H+ = CH2Br2
Quantity | Value | Units | Method | Reference | Comment |
---|---|---|---|---|---|
ΔrH° | 1544. ± 13. | kJ/mol | G+TS | Born, Ingemann, et al., 2000 | gas phase; B |
Quantity | Value | Units | Method | Reference | Comment |
ΔrG° | 1512. ± 13. | kJ/mol | IMRB | Born, Ingemann, et al., 2000 | gas phase; B |

Vibrational and/or electronic energy levels

Data compiled by: Takehiko Shimanouchi

Symmetry:   C     Symmetry Number σ = 2

 Sym.   No   Approximate   Selected Freq.  Infrared   Raman   Comments
 Species   type of mode   Value   Rating   Value  Phase  Value  Phase

a1 1 CH2 s-str 3009  C 3009 W gas 3008 gas
a1 2 CH2 scis 1382  C 1382 VW gas 1402 gas
a1 3 CBr2 s-str 588  C 588 M gas 584 gas
a1 4 CBr2 scis 169  C 169 gas
a2 5 CH2 twist 1095  D  ia 1095 liq.
b1 6 CH2 a-str 3073  B 3073 VW gas 3064 liq.
b1 7 CH2 rock 812  B 812 M gas 813 liq.
b2 8 CH2 wag 1195  B 1195 VS gas 1195 liq.
b2 9 CBr a-str 653  B 653 VS gas 640 gas

Source: Shimanouchi, 1972

Kovats' RI, non-polar column, isothermal

View large format table.

Column type Active phase Temperature (C) I Reference Comment
PackedOV-1100.690.Castello and Gerbino, 1988He, Chromosorb W DMCS; Column length: 3. m
PackedOV-1125.698.Castello and Gerbino, 1988He, Chromosorb W DMCS; Column length: 3. m
PackedOV-175.683.Castello and Gerbino, 1988He, Chromosorb W DMCS; Column length: 3. m
PackedApolane70.681.7Riedo, Fritz, et al., 1976He, Chromosorb; Column length: 2.4 m
PackedSqualane27.653.Hively and Hinton, 1968He, Chromosorb P; Column length: 15. m; Column diameter: 0.25 mm
PackedSqualane49.660.Hively and Hinton, 1968He, Chromosorb P; Column length: 15. m; Column diameter: 0.25 mm
PackedSqualane67.666.Hively and Hinton, 1968He, Chromosorb P; Column length: 15. m; Column diameter: 0.25 mm
PackedSqualane86.671.Hively and Hinton, 1968He, Chromosorb P; Column length: 15. m; Column diameter: 0.25 mm

Kovats' RI, polar column, isothermal

View large format table.

Column type Active phase Temperature (C) I Reference Comment
CapillaryPEG-40M120.1166.Grigor'eva, Vasil'ev, et al., 199340. m/0.25 mm/0.10 μm, Ar
PackedSP-1000100.1189.98Castello and Gerbino, 1988He, Chromosorb W DMCS; Column length: 3. m
PackedSP-1000125.1196.47Castello and Gerbino, 1988He, Chromosorb W DMCS; Column length: 3. m
PackedSP-100075.1175.95Castello and Gerbino, 1988He, Chromosorb W DMCS; Column length: 3. m

Van Den Dool and Kratz RI, non-polar column, temperature ramp

View large format table.

Column type Active phase I Reference Comment
CapillaryDB-1672.2Helmig, Pollock, et al., 199630. m/0.25 mm/1. μm, 6. K/min; Tstart: -50. C; Tend: 180. C
CapillarySE-54700.Weber, 198625. m/0.31 mm/0.17 μm, H2, 2. K/min; Tstart: 35. C
CapillarySE-54700.Weber, 198625. m/0.31 mm/0.17 μm, H2, 2. K/min; Tstart: 35. C
CapillarySE-54704.Weber, 198625. m/0.31 mm/0.17 μm, H2, 2. K/min; Tstart: 35. C

Van Den Dool and Kratz RI, polar column, temperature ramp

View large format table.

Column type Active phase I Reference Comment
CapillarySupelcowax-101174.Matiella and Hsieh, 199060. m/0.25 mm/0.25 μm, 40. C @ 5. min, 2. K/min, 175. C @ 20. min

Normal alkane RI, non-polar column, temperature ramp

View large format table.

Column type Active phase I Reference Comment
CapillaryHP-1696.Peters, de Leer, et al., 199425. m/0.2 mm/0.33 μm, He, 50. C @ 5. min, 8. K/min, 300. C @ 10. min

Normal alkane RI, non-polar column, custom temperature program

View large format table.

Column type Active phase I Reference Comment
CapillarySPB-1683.Flanagan, Streete, et al., 199760. m/0.53 mm/5. μm, He; Program: 40C(6min) => 5C/min => 80C => 10C/min => 200C
CapillaryDB-5708.Sorimachi, Tanabe, et al., 1995He; Column length: 30. m; Program: not specified
CapillarySPB-1683.Strete, Ruprah, et al., 199260. m/0.53 mm/5.0 μm, Helium; Program: 40 0C (6 min) 5 0C/min -> 80 0C 10 0C/min -> 200 0C
CapillarySPB-1733.Strete, Ruprah, et al., 199260. m/0.53 mm/5.0 μm, Helium; Program: not specified

Normal alkane RI, polar column, custom temperature program

View large format table.

Column type Active phase I Reference Comment
CapillaryCarbowax 20M1185.Ramsey and Flanagan, 1982Program: not specified

References

Shehatta, 1993
Shehatta, I.,
Heat capacity at constant pressure of some halogen compounds,
Thermochim. Acta, 1993, 213, 1-10. [all data]
Harrison and Moelwyn-Hughes, 1957
Harrison, D.; Moelwyn-Hughes, E.A.,
The heat capacities of certain liquids,
Proc. Roy. Soc. (London), 1957, A239, 230-246. [all data]
Kurbatov, 1948
Kurbatov, V.Ya.,
Heat capacity of liquids. 2. Heat capacity and the temperature dependence of heat capacity from halogen derivatives of acylic hydrocarbons,
Zh. Obshch. Kim., 1948, 18, 372-389. [all data]
Timmermans, 1952
Timmermans, J.,
Freezing points of organic compounds. VVI New determinations.,
Bull. Soc. Chim. Belg., 1952, 61, 393. [all data]
Timmermans, 1921
Timmermans, J.,
The Freezing Points of Organic Substances IV. New Exp. Determinations,
Bull. Soc. Chim. Belg., 1921, 30, 62. [all data]
Majer and Svoboda, 1985
Majer, V.; Svoboda, V.,
Enthalpies of Vaporization of Organic Compounds: A Critical Review and Data Compilation, Blackwell Scientific Publications, Oxford, 1985, 300. [all data]
Laynez and Wadso, 1972
Laynez, J.; Wadso, I.,
Enthalpies of vaporization of organic compounds. IX. Some halogen substituted hydrocarbons and esters,
Acta Chem. Scand., 1972, 26, 3148. [all data]
Laynez, Wadsö, et al., 1972
Laynez, José; Wadsö, Ingemar; Haug, Arne; Songstad, J.; Pilotti, Åke,
Enthalpies of Vaporization of Organic Compounds. IX. Some Halogen Substituted Hydrocarbons and Esters.,
Acta Chem. Scand., 1972, 26, 3148-3152, https://doi.org/10.3891/acta.chem.scand.26-3148
. [all data]
Kudchadker, Kudchadker, et al., 1979
Kudchadker, A.P.; Kudchadker, S.A.; Shukla, R.P.; Patnaik, P.R.,
Vapor pressures and boiling points of selected halomethanes,
J. Phys. Chem. Ref. Data, 1979, 8, 2, 499, https://doi.org/10.1063/1.555600
. [all data]
Stull, 1947
Stull, Daniel R.,
Vapor Pressure of Pure Substances. Organic and Inorganic Compounds,
Ind. Eng. Chem., 1947, 39, 4, 517-540, https://doi.org/10.1021/ie50448a022
. [all data]
Born, Ingemann, et al., 2000
Born, M.; Ingemann, S.; Nibbering, N.M.M.,
Thermochemical properties of halogen-substituted methanes, methyl radicals, and carbenes in the gas phase,
Int. J. Mass Spectrom., 2000, 194, 2-3, 103-113, https://doi.org/10.1016/S1387-3806(99)00125-6
. [all data]
Yang and Yang, 1992
Yang, P.-F.; Yang, K.G.,
J. Am. Chem. Soc., 1992, 114, 6937. [all data]
Ma, Liao, et al., 1993
Ma, Z.-X.; Liao, C.-L.; Ng, C.Y.; Ma, N.G.; Li, W.-K.,
Adiabatic ionization energy and electron affinity of CH2Br,
J. Chem. Phys., 1993, 99, 6470. [all data]
Kaposi, Riedel, et al., 1976
Kaposi, O.; Riedel, M.; Vass-Balthazar, K.; Sanchez, G.R.; Lelik, L.,
Mass-spectrometric determination of thermochemical data of CHBr3 and CBr4 by study of their electron impact and heterogeneous pyrolytic decompositions,
Acta Chim. Acad. Sci. Hung., 1976, 89, 221. [all data]
Tsai, Baer, et al., 1975
Tsai, B.P.; Baer, T.; Werner, A.S.; Lin, S.F.,
A photoelectron-photoion coincidence study of the ionization and fragment appearance potentials of bromo- and iodomethanes,
J. Phys. Chem., 1975, 79, 570. [all data]
Watanabe, Nakayama, et al., 1962
Watanabe, K.; Nakayama, T.; Mottl, J.,
Ionization potentials of some molecules,
J. Quant. Spectry. Radiative Transfer, 1962, 2, 369. [all data]
Von Niessen, Asbrink, et al., 1982
Von Niessen, W.; Asbrink, L.; Bieri, G.,
30.4 nm He(II) Photoelectron spectra of organic molecules. Part VI. Halogeno-compounds (C,H,X: X = Cl, Br, I),
J. Electron Spectrosc. Relat. Phenom., 1982, 26, 173. [all data]
Wittel and Bock, 1974
Wittel, K.; Bock, H.,
Photoelektronenspekten und molekuleigenschaften. XXVII. Chlor- und bromathylene- beispiele fur anderungen in π- und σ-Systemen,
Chem. Ber., 1974, 107, 317. [all data]
Dixon, Murrell, et al., 1971
Dixon, R.N.; Murrell, J.N.; Narayan, B.,
The photoelectron spectra of the halomethanes,
Mol. Phys., 1971, 20, 611. [all data]
Potts, Lempka, et al., 1970
Potts, A.W.; Lempka, H.J.; Streets, D.G.; Price, W.C.,
Photoelectron spectra of the halides of elements in groups III, IV, V and VI,
Phil. Trans. Roy. Soc. (London), 1970, A268, 59. [all data]
DeCorpo, Bafus, et al., 1971
DeCorpo, J.J.; Bafus, D.A.; Franklin, J.L.,
Enthalpies of formation of the monohalomethyl radicals from mass spectrometric studies of the dihalomethanes,
J. Chem. Thermodyn., 1971, 3, 125. [all data]
Franklin and Haney, 1970
Franklin, J.L.; Haney, M.A.,
Energy distribution in ionic decomposition processes, Recent Developments in Mass Spectroscopy, ed. K. Ogata and T. Hayakawa Baltimore Univ. Park Press, Baltimore, MD, 1970, 909. [all data]
Reed and Snedden, 1956
Reed, R.I.; Snedden, W.,
Studies in electron impact methods. Part 6.-The formation of the methine and carbon ions,
J. Chem. Soc. Faraday Trans., 1956, 55, 876. [all data]
Holmes, Lossing, et al., 1988
Holmes, J.L.; Lossing, F.P.; McFarlane, R.A.,
Stabilization energy and positional effects in halogen-substituted alkyl ions.,
Int. J. Mass Spectrom. Ion Phys., 1988, 86, 209. [all data]