Borane, compd. with dimethylamine (1:1)
- Formula: C2H9BN
- Molecular weight: 57.911
- IUPAC Standard InChIKey: RUOMFVPJBOADHA-UHFFFAOYSA-N
- CAS Registry Number: 74-94-2
- Chemical structure:
View 3d structure (requires JavaScript / HTML 5) - Species with the same structure:
- Other names: Boron, trihydro(N-methylmethanamine)-, (T-4)-; Dimethylamine, compd. with borane (1:1); Dimethylamine borane; Dimethylamine compound with borane (1:1); ((CH3)2NH)(BH3); Borane-dimethylamine complex; Borane-dimethylamine; Boron hydride-dimethylamine; Boron, (N-methylmethanamine)trihydro-, (T-4)-; Methanamine, N-methyl-, compd. with borane (1:1); Boron, trihydro(N-methylmethanamine)-; (Dimethylamine)trihydroboron; Borane, compd. with N-methylmethanamine (1:1); NSC 10218; dimethylamine--borane (1:1)

Phase change data

Data compiled by: William E. Acree, Jr., James S. Chickos
Enthalpy of sublimation
ΔsubH (kJ/mol) | Temperature (K) | Method | Reference |
---|---|---|---|
77.4 ± 2.9 | 273. to 308. | ME | Keiser and Kana'an, 1969 |

Gas phase ion energetics data

Data compiled by: Sharon G. Lias, Rhoda D. Levin, and Sherif A. Kafafi
Ionization energy determinations
IE (eV) | Method | Reference |
---|---|---|
9.39 ± 0.01 | PE | Lloyd and Lynaugh, 1972 |

References

Keiser and Kana'an, 1969
Keiser, D.; Kana'an, A.S.,
Enthalpy and entropy of sublimation of tetraphenyltin and hexaphenylditin. Bond dissociation energy of Sn-C and Sn-Sn,
J. Phys. Chem., 1969, 73, 12, 4264-4269, https://doi.org/10.1021/j100846a038
. [all data]
Lloyd and Lynaugh, 1972
Lloyd, D.R.; Lynaugh, N.,
Photoelectron studies of boron compounds. Part 3. Complexes of borane with Lewis bases,
J. Chem. Soc. Faraday Trans. 2, 1972, 68, 947. [all data]