Bis(η5-1,3-pentadienyl) iron
- Formula: C10H14Fe
- Molecular weight: 190.063
- CAS Registry Number: 74910-62-6

Gas phase ion energetics data

Data compiled as indicated in comments:
LBLHLM - Sharon G. Lias, John E. Bartmess, Joel F. Liebman, John L. Holmes, Rhoda D. Levin, and W. Gary Mallard
Ionization energy determinations
IE (eV) | Method | Reference | Comment |
---|---|---|---|
6.6 | PE | Gleiter, Bohm, et al., 1984 | LBLHLM |
7.0 | PE | Gleiter, Bohm, et al., 1984 | Vertical value; LBLHLM |

References

Gleiter, Bohm, et al., 1984
Gleiter, R.; Bohm, M.C.; Ernst, R.D.,
The He(I) photoelectron spectrum of bis(pentadienyl)-iron: A comparison with the ferrocene spectrum,
J. Electron Spectrosc. Relat. Phenom., 1984, 33, 269. [all data]