2H-Inden-2-one, 1-ethyloctahydro-
- Formula: C11H18O
- Molecular weight: 166.2600
- IUPAC Standard InChIKey: KFVABXQTUAXRFS-UHFFFAOYSA-N
- CAS Registry Number: 74895-96-8
- Chemical structure:
View 3d structure (requires JavaScript / HTML 5) - Permanent link for this species. Use this link for bookmarking this species for future reference.

Gas phase ion energetics data

Data compiled by: Sharon G. Lias, Rhoda D. Levin, and Sherif A. Kafafi
Ionization energy determinations
IE (eV) | Method | Reference |
---|---|---|
9.45 ± 0.08 | EI | Jaudon and Tabet, 1980 |

References

Jaudon and Tabet, 1980
Jaudon, P.; Tabet, J.-C.,
Rearrangement of molecular ions following electron impact. IV-Origin of the [M-28]+ ions in the mass spectra of α-methyl-2-decalone,
Org. Mass Spectrom., 1980, 15, 65. [all data]