Methane, iodo-
- Formula: CH3I
- Molecular weight: 141.9390
- IUPAC Standard InChIKey: INQOMBQAUSQDDS-UHFFFAOYSA-N
- CAS Registry Number: 74-88-4
- Chemical structure:
View 3d structure (requires JavaScript / HTML 5) - Isotopologues:
- Other names: Iodomethane; Methyl iodide; CH3I; Halon 10001; Iodometano; Iodure de methyle; Jod-methan; Joodmethaan; Methyljodid; Methyljodide; Metylu jodek; Monoioduro di metile; Rcra waste number U138; UN 2644; Methyl iodine; Monoiodomethane; NSC 9366
- Gas phase thermochemistry data
- Condensed phase thermochemistry data
- Phase change data
- Reaction thermochemistry data
- Henry's Law data
- Gas phase ion energetics data
- Ion clustering data
- IR Spectrum
- Mass spectrum (electron ionization)
- Vibrational and/or electronic energy levels
- Gas Chromatography
- References
- Notes

Gas phase thermochemistry data

Data compiled by: Hussein Y. Afeefy, Joel F. Liebman, and Stephen E. Stein
Quantity | Value | Units | Method | Reference | Comment |
---|---|---|---|---|---|
ΔfH°gas | 14.3 ± 1.4 | kJ/mol | Eqk | Golden, Walsh, et al., 1965 | Reanalyzed by Cox and Pilcher, 1970, Original value = 13.7 ± 0.67 kJ/mol |
ΔfH°gas | 14.6 ± 1.0 | kJ/mol | Eqk | Goy and Pritchard, 1965 | Reanalyzed by Cox and Pilcher, 1970, Original value = 14.2 ± 1.0 kJ/mol |
ΔfH°gas | 16. ± 1. | kJ/mol | Chyd | Carson, Carter, et al., 1961 |

Condensed phase thermochemistry data

Data compiled as indicated in comments:
ALS - Hussein Y. Afeefy, Joel F. Liebman, and Stephen E. Stein
DH - Eugene S. Domalski and Elizabeth D. Hearing
Quantity | Value | Units | Method | Reference | Comment |
---|---|---|---|---|---|
ΔfH°liquid | -13.6 ± 0.5 | kJ/mol | Ccr | Carson, Laye, et al., 1993 | ALS |
ΔfH°liquid | -12. ± 1. | kJ/mol | Chyd | Carson, Carter, et al., 1961 | ALS |
Quantity | Value | Units | Method | Reference | Comment |
ΔcH°liquid | -808.6 ± 0.3 | kJ/mol | Ccr | Carson, Laye, et al., 1993 | ALS |
Constant pressure heat capacity of liquid
Cp,liquid (J/mol*K) | Temperature (K) | Reference | Comment |
---|---|---|---|
82.75 | 298.15 | Carson, Laye, et al., 1993 | DH |
82.0 | 298.15 | Shehatta, 1993 | DH |
82.76 | 298.2 | Low and Moelwyn-Hughes, 1962 | T = 293 to 308 K.; DH |
82.68 | 300. | Harrison and Moelwyn-Hughes, 1957 | T = 243 to 303 K.; DH |
148.1 | 298. | Kurbatov, 1948 | T = -56 to 35°C. Mean Cp five temperatures.; DH |

Phase change data

Data compiled as indicated in comments:
TRC - Thermodynamics Research Center, NIST Boulder Laboratories, Chris Muzny director
AC - William E. Acree, Jr., James S. Chickos
ALS - Hussein Y. Afeefy, Joel F. Liebman, and Stephen E. Stein
Quantity | Value | Units | Method | Reference | Comment |
---|---|---|---|---|---|
Tboil | 315.7 ± 0.2 | K | AVG | N/A | Average of 7 values; Individual data points |
Quantity | Value | Units | Method | Reference | Comment |
Tfus | 206.7 | K | N/A | Timmermans, 1952 | Uncertainty assigned by TRC = 0.5 K; TRC |
Tfus | 208.1 | K | N/A | Timmermans, 1911 | Uncertainty assigned by TRC = 0.4 K; TRC |
Enthalpy of vaporization
ΔvapH (kJ/mol) | Temperature (K) | Method | Reference | Comment |
---|---|---|---|---|
30.4 | 243. | A | Stephenson and Malanowski, 1987 | Based on data from 228. to 337. K.; AC |
26.5 | 330. | A | Stephenson and Malanowski, 1987 | Based on data from 315. to 502. K.; AC |
31.1 | 217. | N/A | Wren and Vikis, 1982 | Based on data from 208. to 227. K.; AC |
29.2 | 274. | EB | Boublík and Aim, 1972 | Based on data from 259. to 314. K. See also Kudchadker, Kudchadker, et al., 1979.; AC |
30.4 | 233. | N/A | Stull, 1947 | Based on data from 218. to 315. K.; AC |
28.2 | 288. | N/A | Ewert, 1936 | Based on data from 273. to 307. K.; AC |
28.41 | 315.8 | V | Thompson and Linnett, 1936 | ALS |
Antoine Equation Parameters
log10(P) = A − (B / (T + C))
P = vapor pressure (bar)
T = temperature (K)
View plot Requires a JavaScript / HTML 5 canvas capable browser.
Temperature (K) | A | B | C | Reference | Comment |
---|---|---|---|---|---|
218. to 315.6 | 4.1554 | 1177.78 | -32.058 | Stull, 1947 | Coefficents calculated by NIST from author's data. |
315.6 to 521. | 4.14897 | 1223.831 | -20.179 | Stull, 1947 | Coefficents calculated by NIST from author's data. |
273.3 to 307.6 | 5.14281 | 1755.986 | 26.111 | Thompson and Linnett, 1936 | Coefficents calculated by NIST from author's data. |
Enthalpy of sublimation
ΔsubH (kJ/mol) | Temperature (K) | Method | Reference | Comment |
---|---|---|---|---|
40.2 ± 0.4 | 191. | VG | Wren and Vikis, 1982 | Based on data from 176. to 227. K.; AC |
Enthalpy of fusion
ΔfusH (kJ/mol) | Temperature (K) | Reference | Comment |
---|---|---|---|
9.12 | 206.8 | Wren and Vikis, 1982 | AC |

Reaction thermochemistry data

Data compiled as indicated in comments:
B - John E. Bartmess
M - Michael M. Meot-Ner (Mautner) and Sharon G. Lias
ALS - Hussein Y. Afeefy, Joel F. Liebman, and Stephen E. Stein
MS - José A. Martinho Simões
Individual Reactions
By formula: I- + CH3I = (I- • CH3I)
Quantity | Value | Units | Method | Reference | Comment |
---|---|---|---|---|---|
ΔrH° | 35.7 ± 0.84 | kJ/mol | N/A | Van Duzor, Wei, et al., 2010 | gas phase; B |
ΔrH° | 32.6 ± 0.84 | kJ/mol | TDAs | Hiraoka, Fujita, et al., 1905 | gas phase; B |
ΔrH° | 35.1 ± 2.1 | kJ/mol | N/A | Arnold, Neumark, et al., 1995 | gas phase; ZEKE data, shift relative to bare I-; B |
ΔrH° | 34.7 ± 2.1 | kJ/mol | PDis | Cyr, Bishea, et al., 1992 | gas phase; B |
ΔrH° | 38. ± 8.4 | kJ/mol | TDAs | Dougherty and Roberts, 1974 | gas phase; B,M |
Quantity | Value | Units | Method | Reference | Comment |
ΔrS° | 68.6 | J/mol*K | HPMS | Dougherty and Roberts, 1974 | gas phase; M |
Quantity | Value | Units | Method | Reference | Comment |
ΔrG° | 11.4 ± 0.84 | kJ/mol | TDAs | Hiraoka, Fujita, et al., 1905 | gas phase; B |
ΔrG° | 17.2 ± 1.3 | kJ/mol | TDAs | Dougherty and Roberts, 1974 | gas phase; B |
By formula: C6H7N+ + CH3I = (C6H7N+ • CH3I)
Quantity | Value | Units | Method | Reference | Comment |
---|---|---|---|---|---|
ΔrH° | 41. | kJ/mol | PHPMS | Meot-Ner (Mautner) and El-Shall, 1986 | gas phase; Entropy change calculated or estimated; M |
Quantity | Value | Units | Method | Reference | Comment |
ΔrS° | 75. | J/mol*K | N/A | Meot-Ner (Mautner) and El-Shall, 1986 | gas phase; Entropy change calculated or estimated; M |
Free energy of reaction
ΔrG° (kJ/mol) | T (K) | Method | Reference | Comment |
---|---|---|---|---|
18. | 299. | PHPMS | Meot-Ner (Mautner) and El-Shall, 1986 | gas phase; Entropy change calculated or estimated; M |
By formula: Cl- + CH3I = (Cl- • CH3I)
Quantity | Value | Units | Method | Reference | Comment |
---|---|---|---|---|---|
ΔrH° | 41.0 ± 0.84 | kJ/mol | TDAs | Dougherty and Roberts, 1974 | gas phase; B,M |
Quantity | Value | Units | Method | Reference | Comment |
ΔrS° | 31. | J/mol*K | HPMS | Dougherty and Roberts, 1974 | gas phase; Entropy change is questionable; M |
Quantity | Value | Units | Method | Reference | Comment |
ΔrG° | 29. ± 5.4 | kJ/mol | TDAs | Dougherty and Roberts, 1974 | gas phase; B |
By formula: HI + CH3I = CH4 + I2
Quantity | Value | Units | Method | Reference | Comment |
---|---|---|---|---|---|
ΔrH° | -52.55 ± 0.54 | kJ/mol | Eqk | Golden, Walsh, et al., 1965 | gas phase; ALS |
ΔrH° | -53.0 ± 0.2 | kJ/mol | Eqk | Goy and Pritchard, 1965 | gas phase; ALS |
ΔrH° | -46.2 ± 5.6 | kJ/mol | Cm | Nichol and Ubbelohde, 1952 | gas phase; ALS |
C12H16Nb (cr) + 2 (cr) = C10H10I2Nb (cr) + 2
(l)
By formula: C12H16Nb (cr) + 2I2 (cr) = C10H10I2Nb (cr) + 2CH3I (l)
Quantity | Value | Units | Method | Reference | Comment |
---|---|---|---|---|---|
ΔrH° | -242.3 ± 2.4 | kJ/mol | RSC | Diogo, Simoni, et al., 1993 | The difference between the enthalpies of formation of Nb(Cp)2(I)2 and Nb(Cp)2(Me)2 is calculated as -215.1 ± 2.6 kJ/mol; MS |
C14H22CoN5O4 (solution) + (solution) = C13H19CoIN5O4 (solution) +
(solution)
By formula: C14H22CoN5O4 (solution) + I2 (solution) = C13H19CoIN5O4 (solution) + CH3I (solution)
Quantity | Value | Units | Method | Reference | Comment |
---|---|---|---|---|---|
ΔrH° | -92.9 ± 2.5 | kJ/mol | RSC | Toscano, Seligson, et al., 1989 | solvent: Bromoform; The enthalpy of solution of Co(py)(dmg)2(Me)(cr) was measured as 10.9 kJ/mol Toscano, Seligson, et al., 1989; MS |
By formula: CH3I2- + 2CH3I = C2H6I3-
Quantity | Value | Units | Method | Reference | Comment |
---|---|---|---|---|---|
ΔrH° | 29.3 ± 0.84 | kJ/mol | TDAs | Hiraoka, Fujita, et al., 1905 | gas phase; B |
Quantity | Value | Units | Method | Reference | Comment |
ΔrG° | 4.35 ± 0.84 | kJ/mol | TDAs | Hiraoka, Fujita, et al., 1905 | gas phase; B |
(cr) +
(solution) = CH3IMg (solution)
By formula: Mg (cr) + CH3I (solution) = CH3IMg (solution)
Quantity | Value | Units | Method | Reference | Comment |
---|---|---|---|---|---|
ΔrH° | -273.6 ± 0.8 | kJ/mol | RSC | Carson and Skinner, 1950 | solvent: Diethyl ether; It was assumed that MeI(l) has a negligible solution enthalpy in ether; MS |
CH2I- + =
Quantity | Value | Units | Method | Reference | Comment |
---|---|---|---|---|---|
ΔrH° | 1616. ± 21. | kJ/mol | G+TS | Ingemann and Nibbering, 1985 | gas phase; B |
Quantity | Value | Units | Method | Reference | Comment |
ΔrG° | 1587. ± 20. | kJ/mol | IMRB | Ingemann and Nibbering, 1985 | gas phase; B |
By formula: C2H6Hg (l) + 2I2 (cr) = 2CH3I (l) + HgI2 (cr)
Quantity | Value | Units | Method | Reference | Comment |
---|---|---|---|---|---|
ΔrH° | -184.5 ± 0.8 | kJ/mol | RSC | Hartley, Pritchard, et al., 1950 | Please also see Pedley and Rylance, 1977 and Cox and Pilcher, 1970, 2.; MS |
(l) + 3
(cr) = GaI3 (cr) + 3
(l)
By formula: C3H9Ga (l) + 3I2 (cr) = GaI3 (cr) + 3CH3I (l)
Quantity | Value | Units | Method | Reference | Comment |
---|---|---|---|---|---|
ΔrH° | -200.0 ± 8.4 | kJ/mol | RSC | Fowell and Mortimer, 1958 | Please also see Pedley and Rylance, 1977 and Cox and Pilcher, 1970, 2.; MS |
(l) + 2
(cr) = CH3GaI2 (cr) + 2
(l)
By formula: C3H9Ga (l) + 2I2 (cr) = CH3GaI2 (cr) + 2CH3I (l)
Quantity | Value | Units | Method | Reference | Comment |
---|---|---|---|---|---|
ΔrH° | -158.6 ± 4.2 | kJ/mol | RSC | Fowell and Mortimer, 1958 | Please also see Pedley and Rylance, 1977 and Cox and Pilcher, 1970, 2.; MS |
C16H34P2Ru (solution) + (solution) = C16H33IP2Ru (solution) +
(solution)
By formula: C16H34P2Ru (solution) + CH3I (solution) = C16H33IP2Ru (solution) + CH4 (solution)
Quantity | Value | Units | Method | Reference | Comment |
---|---|---|---|---|---|
ΔrH° | -188.3 ± 2.9 | kJ/mol | RSC | Luo, Li, et al., 1995 | solvent: Tetrahydrofuran; MS |
C22H36Zr (solution) + 2 (solution) = C20H30I2Zr (solution) + 2
(solution)
By formula: C22H36Zr (solution) + 2I2 (solution) = C20H30I2Zr (solution) + 2CH3I (solution)
Quantity | Value | Units | Method | Reference | Comment |
---|---|---|---|---|---|
ΔrH° | -292.9 ± 2.5 | kJ/mol | RSC | Schock and Marks, 1988 | solvent: Toluene; MS |
C8H5MoNaO3 (solution) + (l) = C9H8MoO3 (solution) +
(cr)
By formula: C8H5MoNaO3 (solution) + CH3I (l) = C9H8MoO3 (solution) + INa (cr)
Quantity | Value | Units | Method | Reference | Comment |
---|---|---|---|---|---|
ΔrH° | -32.2 ± 1.3 | kJ/mol | RSC | Nolan, López de la Vega, et al., 1986 | solvent: Tetrahydrofuran; MS |
C12H16Zr (solution) + 2 (solution) = C10H10I2Zr (solution) + 2
(solution)
By formula: C12H16Zr (solution) + 2I2 (solution) = C10H10I2Zr (solution) + 2CH3I (solution)
Quantity | Value | Units | Method | Reference | Comment |
---|---|---|---|---|---|
ΔrH° | -291.2 ± 2.5 | kJ/mol | RSC | Schock and Marks, 1988 | solvent: Toluene; MS |
C22H36Hf (solution) + 2 (solution) = C20H30HfI2 (solution) + 2
(solution)
By formula: C22H36Hf (solution) + 2I2 (solution) = C20H30HfI2 (solution) + 2CH3I (solution)
Quantity | Value | Units | Method | Reference | Comment |
---|---|---|---|---|---|
ΔrH° | -265.3 ± 3.3 | kJ/mol | RSC | Schock and Marks, 1988 | solvent: Toluene; MS |
By formula: H2 + 2CH3I = 2CH4 + I2
Quantity | Value | Units | Method | Reference | Comment |
---|---|---|---|---|---|
ΔrH° | -126. ± 3. | kJ/mol | Chyd | Carson, Carter, et al., 1961 | liquid phase; solvent: Ether; ALS |
By formula: CH4 + CH2I2 = 2CH3I
Quantity | Value | Units | Method | Reference | Comment |
---|---|---|---|---|---|
ΔrH° | -20. ± 4.2 | kJ/mol | Eqk | Furuyama, Golden, et al., 1968 | gas phase; ALS |

Henry's Law data

Data compiled by: Rolf Sander
Henry's Law constant (water solution)
kH(T) = k°H exp(d(ln(kH))/d(1/T) ((1/T) - 1/(298.15 K)))
k°H = Henry's law constant for solubility in water at 298.15 K (mol/(kg*bar))
d(ln(kH))/d(1/T) = Temperature dependence constant (K)
k°H (mol/(kg*bar)) | d(ln(kH))/d(1/T) (K) | Method | Reference | Comment |
---|---|---|---|---|
0.14 | 4300. | M | N/A | |
0.35 | Q | N/A | missing citation give several references for the Henry's law constants but don't assign them to specific species. | |
0.19 | 3800. | M | N/A | |
0.18 | V | N/A | ||
0.17 | C | N/A |

Gas phase ion energetics data

Data evaluated as indicated in comments:
HL - Edward P. Hunter and Sharon G. Lias
L - Sharon G. Lias
Data compiled as indicated in comments:
B - John E. Bartmess
LL - Sharon G. Lias and Joel F. Liebman
LBLHLM - Sharon G. Lias, John E. Bartmess, Joel F. Liebman, John L. Holmes, Rhoda D. Levin, and W. Gary Mallard
LLK - Sharon G. Lias, Rhoda D. Levin, and Sherif A. Kafafi
RDSH - Henry M. Rosenstock, Keith Draxl, Bruce W. Steiner, and John T. Herron
Quantity | Value | Units | Method | Reference | Comment |
---|---|---|---|---|---|
IE (evaluated) | 9.54 ± 0.02 | eV | N/A | N/A | L |
Quantity | Value | Units | Method | Reference | Comment |
Proton affinity (review) | 691.7 | kJ/mol | N/A | Hunter and Lias, 1998 | HL |
Quantity | Value | Units | Method | Reference | Comment |
Gas basicity | 665.5 | kJ/mol | N/A | Hunter and Lias, 1998 | HL |
Electron affinity determinations
EA (eV) | Method | Reference | Comment |
---|---|---|---|
0.110 ± 0.020 | LPES | Kim, Kelley, et al., 1999 | B |
0.30 ± 0.20 | NBIE | Moutinho, Aten, et al., 1974 | Stated electron affinity is the Vertical Detachment Energy; B |
Ionization energy determinations
IE (eV) | Method | Reference | Comment |
---|---|---|---|
9.54 ± 0.05 | EI | Holmes and Lossing, 1991 | LL |
9.54 | PE | Carlson, Gerard, et al., 1988 | LL |
10.86 | S | Baig, Connerade, et al., 1982 | LBLHLM |
9.54 | PE | Kimura, Katsumata, et al., 1981 | LLK |
9.538 | EQ | Lias and Ausloos, 1978 | LLK |
9.54 | PIPECO | Mintz and Baer, 1976 | LLK |
9.53 ± 0.01 | PI | Tsai, Baer, et al., 1975 | LLK |
9.538 | S | Hochmann, Templet, et al., 1975 | LLK |
9.54 | PE | Boschi and Salahub, 1974 | LLK |
9.48 ± 0.03 | EI | Johnstone and Mellon, 1972 | LLK |
9.538 | S | Boschi and Salahub, 1972 | LLK |
9.52 | PE | Brogli and Heilbronner, 1971 | LLK |
10.14 | PE | Brogli and Heilbronner, 1971 | LLK |
9.50 | PE | Ragle, Stenhouse, et al., 1970 | RDSH |
9.54 | PE | Potts, Lempka, et al., 1970 | RDSH |
9.534 ± 0.005 | TE | Baer, Peatman, et al., 1969 | RDSH |
9.538 ± 0.003 | S | Price, 1936 | RDSH |
9.53 | PE | Utsunomiya, Kobayashi, et al., 1980 | Vertical value; LLK |
9.9 | PE | Dromey and Peel, 1974 | Vertical value; LLK |
9.51 | PE | Uehara, Saito, et al., 1973 | Vertical value; LLK |
Appearance energy determinations
Ion | AE (eV) | Other Products | Method | Reference | Comment |
---|---|---|---|---|---|
CH+ | 21.2 ± 0.2 | ? | EI | Reed and Snedden, 1956 | RDSH |
CH2+ | 14.6 ± 0.2 | HI | EI | Tsuda and Hamill, 1964 | RDSH |
CH2I+ | 12.78 | H | EI | Holmes, Lossing, et al., 1988 | LL |
CH2I+ | 12.08 ± 0.09 | H | EI | Martin, Lampe, et al., 1966 | RDSH |
CH3+ | 12.18 | I | PI | Traeger and McLoughlin, 1981 | LLK |
CH3+ | 12.24 ± 0.01 | I | PIPECO | Mintz and Baer, 1976 | LLK |
CH3+ | 12.25 ± 0.03 | I | PI | Tsai, Baer, et al., 1975 | LLK |
CH3+ | 12.07 ± 0.07 | I | EI | Johnstone and Mellon, 1972 | LLK |
CH3+ | 12.260 ± 0.013 | I | PI | Nicholson, 1970 | RDSH |
CH3+ | 12.22 | I | EI | Lossing and Semeluk, 1970 | RDSH |
I+ | 12.9 ± 0.05 | CH3 | EI | Tsuda, Melton, et al., 1964 | RDSH |
De-protonation reactions
CH2I- + =
Quantity | Value | Units | Method | Reference | Comment |
---|---|---|---|---|---|
ΔrH° | 1616. ± 21. | kJ/mol | G+TS | Ingemann and Nibbering, 1985 | gas phase; B |
Quantity | Value | Units | Method | Reference | Comment |
ΔrG° | 1587. ± 20. | kJ/mol | IMRB | Ingemann and Nibbering, 1985 | gas phase; B |

Ion clustering data

Data compiled as indicated in comments:
B - John E. Bartmess
M - Michael M. Meot-Ner (Mautner) and Sharon G. Lias
Clustering reactions
By formula: CH3I2- + 2CH3I = C2H6I3-
Quantity | Value | Units | Method | Reference | Comment |
---|---|---|---|---|---|
ΔrH° | 29.3 ± 0.84 | kJ/mol | TDAs | Hiraoka, Fujita, et al., 1905 | gas phase; B |
Quantity | Value | Units | Method | Reference | Comment |
ΔrG° | 4.35 ± 0.84 | kJ/mol | TDAs | Hiraoka, Fujita, et al., 1905 | gas phase; B |
By formula: C6H7N+ + CH3I = (C6H7N+ • CH3I)
Quantity | Value | Units | Method | Reference | Comment |
---|---|---|---|---|---|
ΔrH° | 41. | kJ/mol | PHPMS | Meot-Ner (Mautner) and El-Shall, 1986 | gas phase; Entropy change calculated or estimated; M |
Quantity | Value | Units | Method | Reference | Comment |
ΔrS° | 75. | J/mol*K | N/A | Meot-Ner (Mautner) and El-Shall, 1986 | gas phase; Entropy change calculated or estimated; M |
Free energy of reaction
ΔrG° (kJ/mol) | T (K) | Method | Reference | Comment |
---|---|---|---|---|
18. | 299. | PHPMS | Meot-Ner (Mautner) and El-Shall, 1986 | gas phase; Entropy change calculated or estimated; M |
By formula: Cl- + CH3I = (Cl- • CH3I)
Quantity | Value | Units | Method | Reference | Comment |
---|---|---|---|---|---|
ΔrH° | 41.0 ± 0.84 | kJ/mol | TDAs | Dougherty and Roberts, 1974 | gas phase; B,M |
Quantity | Value | Units | Method | Reference | Comment |
ΔrS° | 31. | J/mol*K | HPMS | Dougherty and Roberts, 1974 | gas phase; Entropy change is questionable; M |
Quantity | Value | Units | Method | Reference | Comment |
ΔrG° | 29. ± 5.4 | kJ/mol | TDAs | Dougherty and Roberts, 1974 | gas phase; B |
By formula: I- + CH3I = (I- • CH3I)
Quantity | Value | Units | Method | Reference | Comment |
---|---|---|---|---|---|
ΔrH° | 35.7 ± 0.84 | kJ/mol | N/A | Van Duzor, Wei, et al., 2010 | gas phase; B |
ΔrH° | 32.6 ± 0.84 | kJ/mol | TDAs | Hiraoka, Fujita, et al., 1905 | gas phase; B |
ΔrH° | 35.1 ± 2.1 | kJ/mol | N/A | Arnold, Neumark, et al., 1995 | gas phase; ZEKE data, shift relative to bare I-; B |
ΔrH° | 34.7 ± 2.1 | kJ/mol | PDis | Cyr, Bishea, et al., 1992 | gas phase; B |
ΔrH° | 38. ± 8.4 | kJ/mol | TDAs | Dougherty and Roberts, 1974 | gas phase; B,M |
Quantity | Value | Units | Method | Reference | Comment |
ΔrS° | 68.6 | J/mol*K | HPMS | Dougherty and Roberts, 1974 | gas phase; M |
Quantity | Value | Units | Method | Reference | Comment |
ΔrG° | 11.4 ± 0.84 | kJ/mol | TDAs | Hiraoka, Fujita, et al., 1905 | gas phase; B |
ΔrG° | 17.2 ± 1.3 | kJ/mol | TDAs | Dougherty and Roberts, 1974 | gas phase; B |

Vibrational and/or electronic energy levels

Data compiled by: Takehiko Shimanouchi
Symmetry: C3ν Symmetry Number σ = 3
Sym. | No | Approximate | Selected Freq. | Infrared | Raman | Comments | ||||
---|---|---|---|---|---|---|---|---|---|---|
Species | type of mode | Value | Rating | Value | Phase | Value | Phase | |||
a1 | 1 | CH3 s-str | 2933 | E | 2969.8 M | gas | FR(2ν5) | |||
a1 | 1 | CH3 s-str | 2933 | E | 2861.0 M | gas | FR(2ν5) | |||
a1 | 2 | CH3 s-deform | 1252 | A | 1251.5 S | gas | ||||
a1 | 3 | CI str | 533 | A | 532.8 S | gas | ||||
e | 4 | CH3 d-str | 3060 | A | 3060.06 S | gas | ||||
e | 5 | CH3 d-deform | 1436 | C | 1435.5 M | gas | FR(ν3+ν6) | |||
e | 6 | CH3 rock | 882 | A | 882.4 M | gas | ||||
Source: Shimanouchi, 1972

Kovats' RI, non-polar column, isothermal

Column type | Active phase | Temperature (C) | I | Reference | Comment |
---|---|---|---|---|---|
Packed | OV-1 | 100. | 523. | Castello and Gerbino, 1988 | He, Chromosorb W DMCS; Column length: 3. m |
Packed | OV-1 | 125. | 528. | Castello and Gerbino, 1988 | He, Chromosorb W DMCS; Column length: 3. m |
Packed | OV-1 | 75. | 518. | Castello and Gerbino, 1988 | He, Chromosorb W DMCS; Column length: 3. m |
Packed | Apolane | 70. | 528.6 | Riedo, Fritz, et al., 1976 | He, Chromosorb; Column length: 2.4 m |
Packed | Squalane | 27. | 502. | Hively and Hinton, 1968 | He, Chromosorb P; Column length: 15. m; Column diameter: 0.25 mm |
Packed | Squalane | 49. | 508. | Hively and Hinton, 1968 | He, Chromosorb P; Column length: 15. m; Column diameter: 0.25 mm |
Packed | Squalane | 67. | 513. | Hively and Hinton, 1968 | He, Chromosorb P; Column length: 15. m; Column diameter: 0.25 mm |
Packed | Squalane | 86. | 518. | Hively and Hinton, 1968 | He, Chromosorb P; Column length: 15. m; Column diameter: 0.25 mm |
Packed | DC-200 | 100. | 524. | Rohrschneider, 1966 | Column length: 4. m |
Packed | Squalane | 100. | 516. | Rohrschneider, 1966 | Column length: 5. m |
Packed | Apiezon L | 100. | 554. | Rohrschneider, 1966 | Column length: 5. m |

Kovats' RI, polar column, isothermal

Column type | Active phase | Temperature (C) | I | Reference | Comment |
---|---|---|---|---|---|
Packed | SP-1000 | 100. | 804.33 | Castello and Gerbino, 1988 | He, Chromosorb W DMCS; Column length: 3. m |
Packed | SP-1000 | 125. | 802.99 | Castello and Gerbino, 1988 | He, Chromosorb W DMCS; Column length: 3. m |
Packed | SP-1000 | 75. | 818.02 | Castello and Gerbino, 1988 | He, Chromosorb W DMCS; Column length: 3. m |
Packed | Carbowax 20M | 100. | 833. | Rohrschneider, 1966 | Column length: 2. m |

Van Den Dool and Kratz RI, non-polar column, temperature ramp

Column type | Active phase | I | Reference | Comment |
---|---|---|---|---|
Capillary | DB-1 | 506. | Helmig, Pollock, et al., 1996 | 30. m/0.25 mm/1. μm, 6. K/min; Tstart: -50. C; Tend: 180. C |
Capillary | DB-5 | 530. | Helmig, Pollock, et al., 1996 | 60. m/0.33 mm/0.25 μm, 6. K/min; Tstart: -50. C; Tend: 180. C |
Capillary | DB-1 | 523. | Helmig and Greenberg, 1995 | 60. m/0.33 mm/0.25 μm, 6. K/min; Tstart: -50. C; Tend: 180. C |

Normal alkane RI, non-polar column, custom temperature program

Column type | Active phase | I | Reference | Comment |
---|---|---|---|---|
Capillary | Polydimethyl siloxanes | 515. | Zenkevich, 2001 | Program: not specified |
Capillary | SPB-1 | 509. | Flanagan, Streete, et al., 1997 | 60. m/0.53 mm/5. μm, He; Program: 40C(6min) => 5C/min => 80C => 10C/min => 200C |
Capillary | SPB-1 | 509. | Strete, Ruprah, et al., 1992 | 60. m/0.53 mm/5.0 μm, Helium; Program: 40 0C (6 min) 5 0C/min -> 80 0C 10 0C/min -> 200 0C |
Capillary | SPB-1 | 515. | Strete, Ruprah, et al., 1992 | 60. m/0.53 mm/5.0 μm, Helium; Program: not specified |
Capillary | OV-1 | 515. | Ramsey and Flanagan, 1982 | Program: not specified |

Normal alkane RI, polar column, custom temperature program

Column type | Active phase | I | Reference | Comment |
---|---|---|---|---|
Capillary | Carbowax 20M | 806. | Ramsey and Flanagan, 1982 | Program: not specified |

References

Golden, Walsh, et al., 1965
Golden, D.M.; Walsh, R.; Benson, S.W.,
The thermochemistry of the gas phase equilibrium I2 + CH4 «=» CH3I + HI and the heat of formation of the methyl radical,
J. Am. Chem. Soc., 1965, 87, 4053-4057. [all data]
Cox and Pilcher, 1970
Cox, J.D.; Pilcher, G.,
Thermochemistry of Organic and Organometallic Compounds, Academic Press, New York, 1970, 1-636. [all data]
Goy and Pritchard, 1965
Goy, C.A.; Pritchard, H.O.,
Kinetics and thermodynamics of the reaction between iodine and methane and the heat of formation of methyl iodide,
J. Phys. Chem., 1965, 69, 3040-3041. [all data]
Carson, Carter, et al., 1961
Carson, A.S.; Carter, W.; Pedley, J.B.,
The thermochemistry of reductions caused by lithium aluminium hydride I. The C-I bond dissociation energy in CH3I,
Proc. Roy. Soc. London A, 1961, 260, 550-557. [all data]
Carson, Laye, et al., 1993
Carson, A.S.; Laye, P.G.; Pedley, J.B.; Welsby, A.M.,
The enthalpies of formation iodomethane, diiodomethane, triiodomethane, and tetraiodomethane by rotating combustion calorimetry,
J. Chem. Thermodyn., 1993, 25, 261-269. [all data]
Shehatta, 1993
Shehatta, I.,
Heat capacity at constant pressure of some halogen compounds,
Thermochim. Acta, 1993, 213, 1-10. [all data]
Low and Moelwyn-Hughes, 1962
Low, D.I.R.; Moelwyn-Hughes, E.A.,
The heat capacities of acetone, methyl iodide and mixtures thereof in the liquid state,
Proc. Roy. Soc. (London), 1962, A267, 384-394. [all data]
Harrison and Moelwyn-Hughes, 1957
Harrison, D.; Moelwyn-Hughes, E.A.,
The heat capacities of certain liquids,
Proc. Roy. Soc. (London), 1957, A239, 230-246. [all data]
Kurbatov, 1948
Kurbatov, V.Ya.,
Heat capacity of liquids. 2. Heat capacity and the temperature dependence of heat capacity from halogen derivatives of acylic hydrocarbons,
Zh. Obshch. Kim., 1948, 18, 372-389. [all data]
Timmermans, 1952
Timmermans, J.,
Freezing points of organic compounds. VVI New determinations.,
Bull. Soc. Chim. Belg., 1952, 61, 393. [all data]
Timmermans, 1911
Timmermans, J.,
Researches on the freezing point of organic liquid compounds,
Bull. Soc. Chim. Belg., 1911, 25, 300. [all data]
Stephenson and Malanowski, 1987
Stephenson, Richard M.; Malanowski, Stanislaw,
Handbook of the Thermodynamics of Organic Compounds, 1987, https://doi.org/10.1007/978-94-009-3173-2
. [all data]
Wren and Vikis, 1982
Wren, D.J.; Vikis, A.C.,
Vapour pressure of CH3I in the temperature range 176 to 227 K,
The Journal of Chemical Thermodynamics, 1982, 14, 5, 435-437, https://doi.org/10.1016/0021-9614(82)90135-5
. [all data]
Boublík and Aim, 1972
Boublík, T.; Aim, K.,
Heats of vaporization of simple non-spherical molecule compounds,
Collect. Czech. Chem. Commun., 1972, 37, 11, 3513-3521, https://doi.org/10.1135/cccc19723513
. [all data]
Kudchadker, Kudchadker, et al., 1979
Kudchadker, A.P.; Kudchadker, S.A.; Shukla, R.P.; Patnaik, P.R.,
Vapor pressures and boiling points of selected halomethanes,
J. Phys. Chem. Ref. Data, 1979, 8, 2, 499, https://doi.org/10.1063/1.555600
. [all data]
Stull, 1947
Stull, Daniel R.,
Vapor Pressure of Pure Substances. Organic and Inorganic Compounds,
Ind. Eng. Chem., 1947, 39, 4, 517-540, https://doi.org/10.1021/ie50448a022
. [all data]
Ewert, 1936
Ewert, M.,
Bull. Soc. Chim. Belg., 1936, 45, 493. [all data]
Thompson and Linnett, 1936
Thompson, H.W.; Linnett, J.W.,
The vapour pressures and association of some metallic and non-metallic alkyls,
Trans. Faraday Soc., 1936, 32, 681-685. [all data]
Van Duzor, Wei, et al., 2010
Van Duzor, M.; Wei, J.; Mbaiwa, F.; Mabbs, R.,
I-center dot CH3X (X=Cl, Br, I) photodetachment: The effect of electron-molecule interactions in cluster anion photodetachment spectra and angular distributions,
J. Chem. Phys., 2010, 133, 14, 144303, https://doi.org/10.1063/1.3487739
. [all data]
Hiraoka, Fujita, et al., 1905
Hiraoka, K.; Fujita, K.; Ishida, M.; Ichikawa, T.; Okada, H.; Hiizumi, K.; Wada, A.; Takao, K.; Yamabe, S.; Tsuchida, N.,
Gas-phase Ion/Molecule Reactions in C5F8,
J. Phys. Chem. A (2005), 1905, 109, 6, 1049-1056., https://doi.org/10.1021/jp040251k
. [all data]
Arnold, Neumark, et al., 1995
Arnold, C.C.; Neumark, D.M.; Cyr, D.M.; Johnson, M.A.,
Negative ion zero electron kinetic energy spectroscopy of I-center dot CH3I,
J. Phys. Chem., 1995, 99, 6, 1633, https://doi.org/10.1021/j100006a002
. [all data]
Cyr, Bishea, et al., 1992
Cyr, D.M.; Bishea, G.A.; Scarton, M.G.; Johnson, M.A.,
Observation of Charge-Transfer Excited States in the I-.CH3I, I-.CH3Br, and I-.CH2Br2 S(N)2 Reaction Intermediates Using Photofragmentation,
J. Chem. Phys., 1992, 97, 8, 5911, https://doi.org/10.1063/1.463752
. [all data]
Dougherty and Roberts, 1974
Dougherty, R.C.; Roberts, J.D.,
SN2 reactions in the gas phase. Nucleophilicity effects,
Org. Mass Spectrom., 1974, 8, 81. [all data]
Meot-Ner (Mautner) and El-Shall, 1986
Meot-Ner (Mautner), M.; El-Shall, M.S.,
Ionic Charge Transfer Complexes. 1. Cationic Complexes with Delocalized and Partially Localized pi Systems,
J. Am. Chem. Soc., 1986, 108, 15, 4386, https://doi.org/10.1021/ja00275a026
. [all data]
Nichol and Ubbelohde, 1952
Nichol, R.J.; Ubbelohde, A.R.,
A thermochemical evaluation of bond strengths in some carbon compounds. part II. Bond strengths based on the reaction CH3I + HI = CH4 + I2,
J. Am. Chem. Soc., 1952, 415-421. [all data]
Diogo, Simoni, et al., 1993
Diogo, H.P.; Simoni, J.A.; Minas da Piedade, M.E.; Dias, A.R.; Martinho Simões, J.A.,
J. Am. Chem. Soc., 1993, 115, 2764. [all data]
Toscano, Seligson, et al., 1989
Toscano, P.J.; Seligson, A.L.; Curran, M.T.; Skrobutt, A.T.; Sonnenberger, D.C.,
Inorg. Chem., 1989, 28, 166; ibid. 1989. [all data]
Carson and Skinner, 1950
Carson, A.S.; Skinner, H.A.,
Nature, 1950, 165, 484. [all data]
Ingemann and Nibbering, 1985
Ingemann, S.; Nibbering, N.M.M.,
Gas-phase acidity of CH3X [X = P(CH3)2, SCH3, F, Cl, Br, I] compounds,
J. Chem. Soc. Perkin Trans. 2, 1985, 837. [all data]
Hartley, Pritchard, et al., 1950
Hartley, K.; Pritchard, H.O.; Skinner, H.A.,
Thermochemistry of metallic alkyls. III.?mercury dimethyl and mercury methyl halides,
Trans. Faraday Soc., 1950, 46, 1019, https://doi.org/10.1039/tf9504601019
. [all data]
Pedley and Rylance, 1977
Pedley, J.B.; Rylance, J.,
Computer Analysed Thermochemical Data: Organic and Organometallic Compounds, University of Sussex, Brigton, 1977. [all data]
Cox and Pilcher, 1970, 2
Cox, J.D.; Pilcher, G.,
Thermochemistry of Organic and Organometallic Compounds
in Academic Press, New York, 1970. [all data]
Fowell and Mortimer, 1958
Fowell, P.A.; Mortimer, C.T.,
J. Chem. Soc., 1958, 3734.. [all data]
Luo, Li, et al., 1995
Luo, L.; Li, C.; Cucullu, M.E.; Nolan, S.P.,
Organometallics, 1995, 14, 1333. [all data]
Schock and Marks, 1988
Schock, L.E.; Marks, T.J.,
J. Am. Chem. Soc., 1988, 110, 7701. [all data]
Nolan, López de la Vega, et al., 1986
Nolan, S.P.; López de la Vega, R.; Hoff, C.D.,
J. Organometal. Chem., 1986, 315, 187. [all data]
Furuyama, Golden, et al., 1968
Furuyama, S.; Golden, D.M.; Benson, S.W.,
The thermochemistry of the gas-phase equilibrium 2CH3I = CH4 + CH2i2. The heat of formation of CH2I2,
J. Phys. Chem., 1968, 72, 4713-4715. [all data]
Hunter and Lias, 1998
Hunter, E.P.; Lias, S.G.,
Evaluated Gas Phase Basicities and Proton Affinities of Molecules: An Update,
J. Phys. Chem. Ref. Data, 1998, 27, 3, 413-656, https://doi.org/10.1063/1.556018
. [all data]
Kim, Kelley, et al., 1999
Kim, J.; Kelley, J.A.; Ayotte, P.; Nielsen, S.B.; Weddle, G.H.; Johnson, M.A.,
Preparation and photoelectron spectrum of the CH3I- anion: Rare gas cluster mediated synthesis of an ion-radical complex,
J. Am. Soc. Mass Spectrom., 1999, 10, 9, 810-814, https://doi.org/10.1016/S1044-0305(99)00057-4
. [all data]
Moutinho, Aten, et al., 1974
Moutinho, A.M.C.; Aten, J.A.; Los, J.,
Chemi-ionization in alkali-methylhalogen collisions,
Chem. Phys., 1974, 5, 84. [all data]
Holmes and Lossing, 1991
Holmes, J.L.; Lossing, F.P.,
Ionization energies of homologous organic compounds and correlation with molecular size,
Org. Mass Spectrom., 1991, 26, 537. [all data]
Carlson, Gerard, et al., 1988
Carlson, T.A.; Gerard, P.; Pullen, B.P.; Grimm, F.A.,
Autoionization from the ione-pair orbitals of molecules containing iodine,
J. Chem. Phys., 1988, 89, 1464. [all data]
Baig, Connerade, et al., 1982
Baig, M.A.; Connerade, J.P.; Hormes, J.,
Autoionisation resonances in the 4p(Π) spectrum of methyl bromide,
J. Phys. B:, 1982, 15, 5. [all data]
Kimura, Katsumata, et al., 1981
Kimura, K.; Katsumata, S.; Achiba, Y.; Yamazaki, T.; Iwata, S.,
Ionization energies, Ab initio assignments, and valence electronic structure for 200 molecules
in Handbook of HeI Photoelectron Spectra of Fundamental Organic Compounds, Japan Scientific Soc. Press, Tokyo, 1981. [all data]
Lias and Ausloos, 1978
Lias, S.G.; Ausloos, P.J.,
eIonization energies of organic compounds by equilibrium measurements,
J. Am. Chem. Soc., 1978, 100, 6027. [all data]
Mintz and Baer, 1976
Mintz, D.M.; Baer, T.,
Kinetic energy release distributions for the dissociation of internal energy selected CH3I+ and CD3I+ ions,
J. Chem. Phys., 1976, 65, 2407. [all data]
Tsai, Baer, et al., 1975
Tsai, B.P.; Baer, T.; Werner, A.S.; Lin, S.F.,
A photoelectron-photoion coincidence study of the ionization and fragment appearance potentials of bromo- and iodomethanes,
J. Phys. Chem., 1975, 79, 570. [all data]
Hochmann, Templet, et al., 1975
Hochmann, P.; Templet, P.H.; Wang, H.-t.; McGlynn, S.P.,
Molecular Rydberg transitions. I. Low-energy Rydberg transitions in methyl halides,
J. Chem. Phys., 1975, 62, 2588. [all data]
Boschi and Salahub, 1974
Boschi, R.A.A.; Salahub, D.R.,
The high resolution photoelectron spectra of some iodoalkanes, iodocycloalkanes, iodoalkenes, and fluoroiodohydrocarbons,
Can. J. Chem., 1974, 52, 1217. [all data]
Johnstone and Mellon, 1972
Johnstone, R.A.W.; Mellon, F.A.,
Electron-impact ionization and appearance potentials,
J. Chem. Soc. Faraday Trans. 2, 1972, 68, 1209. [all data]
Boschi and Salahub, 1972
Boschi, R.A.; Salahub, D.R.,
The far ultra-violet spectra of some 1-iodoalkanes,
Mol. Phys., 1972, 24, 289. [all data]
Brogli and Heilbronner, 1971
Brogli, F.; Heilbronner, E.,
The competition between spin orbit coupling and conjugation in alkyl halides and its repercussion on their photoelectron spectra,
Helv. Chim. Acta, 1971, 54, 1423. [all data]
Ragle, Stenhouse, et al., 1970
Ragle, J.L.; Stenhouse, I.A.; Frost, D.C.; McDowell, C.A.,
Valence-shell ionization potentials of halomethanes by photoelectron spectroscopy. I. CH3Cl, CH3Br, CH3I. Vibrational frequencies and vibronic interaction in CH3Br+ and CH3Cl+,
J. Chem. Phys., 1970, 53, 178. [all data]
Potts, Lempka, et al., 1970
Potts, A.W.; Lempka, H.J.; Streets, D.G.; Price, W.C.,
Photoelectron spectra of the halides of elements in groups III, IV, V and VI,
Phil. Trans. Roy. Soc. (London), 1970, A268, 59. [all data]
Baer, Peatman, et al., 1969
Baer, T.; Peatman, W.B.; Schlag, E.W.,
Photoionization resonance studies with a steradiancy analyzer. II.The photoionization of CH3I,
Chem. Phys. Lett., 1969, 4, 243. [all data]
Price, 1936
Price, W.C.,
The far ultraviolet absorption spectra and ionization potentials of the alkyl halides. Part I,
J. Chem. Phys., 1936, 4, 539. [all data]
Utsunomiya, Kobayashi, et al., 1980
Utsunomiya, C.; Kobayashi, T.; Nagakura, S.,
Photoelectron angular distribution measurements for some aliphatic alcohols, amines, halides,
Bull. Chem. Soc. Jpn., 1980, 53, 1216. [all data]
Dromey and Peel, 1974
Dromey, R.G.; Peel, J.B.,
Photoelectron spectroscopic correlation of the molecular orbitals of the alkanes and alkyl iodides,
J. Mol. Struct., 1974, 23, 53. [all data]
Uehara, Saito, et al., 1973
Uehara, Y.; Saito, N.; Yonezawa, T.,
Ionization potentials of trifluoromethyl and methyl halides by photoelectron spectroscopy and calculations by extended Hucket and CNDO/2 methods,
Chem. Lett., 1973, 495. [all data]
Reed and Snedden, 1956
Reed, R.I.; Snedden, W.,
Studies in electron impact methods. Part 6.-The formation of the methine and carbon ions,
J. Chem. Soc. Faraday Trans., 1956, 55, 876. [all data]
Tsuda and Hamill, 1964
Tsuda, S.; Hamill, W.H.,
Structure in ionization efficiency curves near threshold from alkanes and alkyl halides,
J. Chem. Phys., 1964, 41, 2713. [all data]
Holmes, Lossing, et al., 1988
Holmes, J.L.; Lossing, F.P.; McFarlane, R.A.,
Stabilization energy and positional effects in halogen-substituted alkyl ions.,
Int. J. Mass Spectrom. Ion Phys., 1988, 86, 209. [all data]
Martin, Lampe, et al., 1966
Martin, R.H.; Lampe, F.W.; Taft, R.W.,
An electron-impact study of ionization and dissociation in methoxy- and halogen- substituted methanes,
J. Am. Chem. Soc., 1966, 88, 1353. [all data]
Traeger and McLoughlin, 1981
Traeger, J.C.; McLoughlin, R.G.,
Absolute heats of formation for gas phase cations,
J. Am. Chem. Soc., 1981, 103, 3647. [all data]
Nicholson, 1970
Nicholson, A.J.C.,
Determination of bond dissociation energies from photoionization efficiency curves
in Recent Developments in Mass Spectrometroscopy, ed. K Ogata and T. Hayakawa, Univ. Park Press, Baltimore, MD, 1970, 745. [all data]
Lossing and Semeluk, 1970
Lossing, F.P.; Semeluk, G.P.,
Free radicals by mass spectrometry. XLII.Ionization potentials and ionic heats of formation for C1-C4 alkyl radicals,
Can. J. Chem., 1970, 48, 955. [all data]
Tsuda, Melton, et al., 1964
Tsuda, S.; Melton, C.E.; Hamill, W.H.,
Ionization- efficiency curves for molecular and fragment ions from methane and the methyl halides,
J. Chem. Phys., 1964, 41, 689. [all data]
Shimanouchi, 1972
Shimanouchi, T.,
Tables of Molecular Vibrational Frequencies Consolidated Volume I, National Bureau of Standards, 1972, 1-160. [all data]
Castello and Gerbino, 1988
Castello, G.; Gerbino, T.C.,
Effect of Temperature on the Gas Chromatographic Separation of Halogenated Compounds on Polar and Non-Polar Stationary Phases,
J. Chromatogr., 1988, 437, 33-45, https://doi.org/10.1016/S0021-9673(00)90369-8
. [all data]
Riedo, Fritz, et al., 1976
Riedo, F.; Fritz, D.; Tarján, G.; Kováts, E.Sz.,
A tailor-made C87 hydrocarbon as a possible non-polar standard stationary phase for gas chromatography,
J. Chromatogr., 1976, 126, 63-83, https://doi.org/10.1016/S0021-9673(01)84063-2
. [all data]
Hively and Hinton, 1968
Hively, R.A.; Hinton, R.E.,
Variation of the retention index with temperature on squalane substrates,
J. Gas Chromatogr., 1968, 6, 4, 203-217, https://doi.org/10.1093/chromsci/6.4.203
. [all data]
Rohrschneider, 1966
Rohrschneider, L.,
Eine methode zur charakterisierung von gaschromatographischen trennflüssigkeiten,
J. Chromatogr., 1966, 22, 6-22, https://doi.org/10.1016/S0021-9673(01)97064-5
. [all data]
Helmig, Pollock, et al., 1996
Helmig, D.; Pollock, W.; Greenberg, J.; Zimmerman, P.,
Gas chromatography mass spectrometry analysis of volatile organic trace gases at Mauna Loa Observatory, Hawaii,
J. Geophys. Res., 1996, 101, D9, 14697-14710, https://doi.org/10.1029/96JD00212
. [all data]
Helmig and Greenberg, 1995
Helmig, D.; Greenberg, J.,
Artifact formation from the use of potassium-iodide-based ozone traps during atmospheric sampling of trace organic gases,
J. Hi. Res. Chromatogr., 1995, 18, 1, 15-18, https://doi.org/10.1002/jhrc.1240180105
. [all data]
Zenkevich, 2001
Zenkevich, I.G.,
Encyclopedia of Chromatography. Derivatization of Acids for GC Analysis, Marcel Dekker, Inc., New York - Basel, 2001, 221. [all data]
Flanagan, Streete, et al., 1997
Flanagan, R.J.; Streete, P.J.; Ramsey, J.D.,
Volatile Substance Abuse, UNODC Technical Series, No 5, United Nations, Office on Drugs and Crime, Vienna International Centre, PO Box 500, A-1400 Vienna, Austria, 1997, 56, retrieved from http://www.odccp.org/pdf/technicalseries1997-01-011.pdf. [all data]
Strete, Ruprah, et al., 1992
Strete, P.J.; Ruprah, M.; Ramsey, J.D.; Flanagan, R.J.,
Detection and identification of volatile substances by headspace capillary gas chromatography to aid the diagnosis of acute poisoning,
Analyst, 1992, 117, 7, 1111-1127, https://doi.org/10.1039/an9921701111
. [all data]
Ramsey and Flanagan, 1982
Ramsey, J.D.; Flanagan, R.J.,
Detection and Identification of Volatile Organic Compounds in Blood by Headspace Gas Chromatography as an Aid to the Diagnosis of Solvent Abuse,
J. Chromatogr., 1982, 240, 2, 423-444, https://doi.org/10.1016/S0021-9673(00)99622-5
. [all data]