p-Benzanisidide
- Formula: C14H13NO2
- Molecular weight: 227.2585
- IUPAC Standard InChIKey: KEEBHMMBUBEEOV-UHFFFAOYSA-N
- CAS Registry Number: 7472-54-0
- Chemical structure:
View 3d structure (requires JavaScript / HTML 5) - Other names: N-Benzoyl-p-anisidine; Benzamide, N-(p-methoxyphenyl)-; Benzamide, N-(4-methoxyphenyl)-; 4'-Methoxybenzanilide; 4Methoxybenzanilide; N-(4-Methoxyphenyl)benzamide; N-(4-Methoxyphenyl)benzoic acid amide

Reaction thermochemistry data

Data compiled by: Hussein Y. Afeefy, Joel F. Liebman, and Stephen E. Stein
Individual Reactions
By formula: C7H9NO + C7H5IO = HI + C14H13NO2
Quantity | Value | Units | Method | Reference | Comment |
---|---|---|---|---|---|
ΔrH° | -185. ± 2. | kJ/mol | Cac | Kiselev, Khuzyasheva, et al., 1979 | liquid phase; solvent: Benzene |
By formula: C7H9NO + C7H5BrO = HBr + C14H13NO2
Quantity | Value | Units | Method | Reference | Comment |
---|---|---|---|---|---|
ΔrH° | -172. ± 0.8 | kJ/mol | Cac | Kiselev, Khuzyasheva, et al., 1979 | liquid phase; solvent: Benzene |
By formula: C7H9NO + C7H5ClO = C14H13NO2 + HCl
Quantity | Value | Units | Method | Reference | Comment |
---|---|---|---|---|---|
ΔrH° | -168. ± 0.8 | kJ/mol | Cac | Kiselev, Khuzyasheva, et al., 1979 | liquid phase; solvent: Benzene |

Gas phase ion energetics data

Data compiled by: Henry M. Rosenstock, Keith Draxl, Bruce W. Steiner, and John T. Herron
Ionization energy determinations
IE (eV) | Method | Reference |
---|---|---|
7.6 ± 0.1 | EI | Shapiro, Turk, et al., 1970 |
Appearance energy determinations
Ion | AE (eV) | Other Products | Method | Reference | Comment |
---|---|---|---|---|---|
C7H5O+ | 11.2 ± 0.1 | ? | EI | Shapiro, Turk, et al., 1970 |

References

Kiselev, Khuzyasheva, et al., 1979
Kiselev, V.D.; Khuzyasheva, d.G.; Konovalov, A.I.,
Thermochemical study of the acylation of para-substituted anilines,
J. Gen. Chem. USSR, 1979, 49, 2273-2276. [all data]
Shapiro, Turk, et al., 1970
Shapiro, R.H.; Turk, J.; Serum, J.W.,
The effect of substituents on the average internal energy of benzoyl ions generated from N-(substituted-phenyl)benzamides,,
Org. Mass Spectrom., 1970, 3, 171. [all data]