1,3-Butadiyne, 1-fluoro-
- Formula: C4HF
- Molecular weight: 68.0491
- IUPAC Standard InChIKey: XLMVPPCMRBLRSB-UHFFFAOYSA-N
- CAS Registry Number: 74706-98-2
- Chemical structure:
View 3d structure (requires JavaScript / HTML 5) - Permanent link for this species. Use this link for bookmarking this species for future reference.

Gas phase ion energetics data

Data compiled by: Sharon G. Lias, Rhoda D. Levin, and Sherif A. Kafafi
Ionization energy determinations
IE (eV) | Method | Reference |
---|---|---|
10.10 | PE | Bieri, Schmelzer, et al., 1980 |

References

Bieri, Schmelzer, et al., 1980
Bieri, G.; Schmelzer, A.; Asbrink, L.; Jonsson, M.,
Fluorine and the fluoroderivatives of acetylene and diacetylene studied by 30.4 nm He(II) photoelectron spectroscopy,
Chem. Phys., 1980, 49, 213. [all data]