9H-Fluorene, 9-(9H-fluoren-9-ylidene)-
- Formula: C26H16
- Molecular weight: 328.4052
- IUPAC Standard InChIKey: NVMYRXGXUBZAIU-UHFFFAOYSA-N
- CAS Registry Number: 746-47-4
- Chemical structure:
View 3d structure (requires JavaScript / HTML 5) - Other names: Δ9,9'-Bifluorene; Bifluorenylidene; Bis[fluorenylidene]; Dibiphenyleneethene; Dibiphenyleneethylene; Difluorenylidene; Diphenyleneethylene; Tetrabenzfulvalene; 9,9'-Bifluorenylidene; 9,9'-Difluorenylidene; Delta^9,9'-bifluorene

Gas phase ion energetics data

Data compiled as indicated in comments:
LLK - Sharon G. Lias, Rhoda D. Levin, and Sherif A. Kafafi
RDSH - Henry M. Rosenstock, Keith Draxl, Bruce W. Steiner, and John T. Herron
Ionization energy determinations
IE (eV) | Method | Reference | Comment |
---|---|---|---|
7.27 ± 0.04 | PE | Boschi, Clar, et al., 1974 | LLK |
8.5 ± 0.2 | EI | Bergmann, 1969 | RDSH |

References

Boschi, Clar, et al., 1974
Boschi, R.; Clar, E.; Schmidt, W.,
Photoelectron spectra of polynuclear aromatics. III. The effect of nonplanarity in sterically overcrowded aromatic hydrocarbons,
J. Chem. Phys., 1974, 60, 4406. [all data]
Bergmann, 1969
Bergmann, E.D.,
Ionization potentials of biological molecules,
Ann. N.Y. Acad. Sci., 1969, 158, 140. [all data]