Selenium monosulfide
- Formula: SSe
- Molecular weight: 111.02
- IUPAC Standard InChIKey: VIDTVPHHDGRGAF-UHFFFAOYSA-N
- CAS Registry Number: 7446-34-6
- Chemical structure:
View 3d structure (requires JavaScript / HTML 5) - Permanent link for this species. Use this link for bookmarking this species for future reference.

Gas phase ion energetics data

Data compiled as indicated in comments:
LBLHLM - Sharon G. Lias, John E. Bartmess, Joel F. Liebman, John L. Holmes, Rhoda D. Levin, and W. Gary Mallard
LLK - Sharon G. Lias, Rhoda D. Levin, and Sherif A. Kafafi
Ionization energy determinations
IE (eV) | Method | Reference | Comment |
---|---|---|---|
9.2 ± 0.2 | EI | Grade, Wienecke, et al., 1983 | LBLHLM |
9.2 ± 0.3 | EI | Drowart and Smoes, 1977 | LLK |

Constants of diatomic molecules

Data compiled by: Klaus P. Huber and Gerhard H. Herzberg
Data collected through July, 1977
Symbol | Meaning |
---|---|
State | electronic state and / or symmetry symbol |
Te | minimum electronic energy (cm-1) |
ωe | vibrational constant – first term (cm-1) |
ωexe | vibrational constant – second term (cm-1) |
ωeye | vibrational constant – third term (cm-1) |
Be | rotational constant in equilibrium position (cm-1) |
αe | rotational constant – first term (cm-1) |
γe | rotation-vibration interaction constant (cm-1) |
De | centrifugal distortion constant (cm-1) |
βe | rotational constant – first term, centrifugal force (cm-1) |
re | internuclear distance (Å) |
Trans. | observed transition(s) corresponding to electronic state |
ν00 | position of 0-0 band (units noted in table) |
State | Te | ωe | ωexe | ωeye | Be | αe | γe | De | βe | re | Trans. | ν00 |
---|---|---|---|---|---|---|---|---|---|---|---|---|
B2 3Σ-1 | (28330) | [327.56] | 1 | [0.1349] | 2 | [2.348] | B2 ← X2 R | 28011 | ||||
↳Ahmed and Barrow, 1974 | ||||||||||||
B1 3Σ-0+ | 28248.2 | [330.82] 3 Z | (2.92) | 0.1369 4 | 0.00121 | 2.331 | B1 ← X1 R | 28138.46 Z | ||||
↳Ahmed and Barrow, 1974 | ||||||||||||
A 0+ | 27328.4 | 332.1 3 5 | (2.66) | 0.1186 4 5 | 0.00095 | 2.504 | A ← X1 R | 27216.5 (Z) | ||||
↳Ahmed and Barrow, 1974 | ||||||||||||
X2 3Σ-1 | 205 6 | 556.26 Z | 1.831 | 0.18121 7 | 0.00089 | 7E-8 | 2.0257 | |||||
State | Te | ωe | ωexe | ωeye | Be | αe | γe | De | βe | re | Trans. | ν00 |
X1 3Σ-0+ | 0 | 555.56 3 Z | 1.848 | 0.17926 | 0.00076 | 6E-8 | 2.0367 |

References

Grade, Wienecke, et al., 1983
Grade, M.; Wienecke, J.; Rosinger, W.; Hirschwald, W.,
Electron impact investigation of the molecules SeS(g) and TeSe(g) under high-temperature equilibrium conditions,
Ber. Bunsen-Ges. Phys. Chem., 1983, 87, 355. [all data]
Drowart and Smoes, 1977
Drowart, J.; Smoes, S.,
Determination by the mass spectrometric Knudsen cell method and discussion of the dissociation energies of the molecules Se2(g), SSe(g) and SeTe(g),
J. Chem. Soc. Faraday Trans. 2, 1977, 73, 1755. [all data]
Ahmed and Barrow, 1974
Ahmed, F.; Barrow, R.F.,
Rotational analysis of absorption bands of gaseous SeS,
J. Phys. B:, 1974, 7, 2256. [all data]
Drowart and Goldfinger, 1966
Drowart, J.; Goldfinger, P.,
The dissociation energies of the group VIA diatomic molecules,
Q. Rev. Chem. Soc., 1966, 20, 545. [all data]