4,5-Benzotricyclo[4.1.0.01,3]hept-4-ene
- Formula: C11H10
- Molecular weight: 142.1971
- IUPAC Standard InChIKey: AMKTWDDHZREJTB-UHFFFAOYSA-N
- CAS Registry Number: 74410-87-0
- Chemical structure:
View 3d structure (requires JavaScript / HTML 5) - Permanent link for this species. Use this link for bookmarking this species for future reference.

Gas phase ion energetics data

Data compiled by: Sharon G. Lias, John E. Bartmess, Joel F. Liebman, John L. Holmes, Rhoda D. Levin, and W. Gary Mallard
Ionization energy determinations
IE (eV) | Method | Reference | Comment |
---|---|---|---|
8.0 | PE | Gleiter, Krennrich, et al., 1986 | |
8.2 | PE | Gleiter, Krennrich, et al., 1986 | Vertical value |

References

Gleiter, Krennrich, et al., 1986
Gleiter, R.; Krennrich, G.; Brinker, U.H.,
Electronic structure of spiropentane and some derivatives,
J. Org. Chem., 1986, 51, 2899. [all data]