calcium
- Formula: Ca
- Molecular weight: 40.078
- IUPAC Standard InChIKey: OYPRJOBELJOOCE-UHFFFAOYSA-N
- CAS Registry Number: 7440-70-2
- Chemical structure:
- NIST Atomic Spectra Database - Lines Holdings (on physics web site)
- NIST Atomic Spectra Database - Levels Holdings (on physics web site)
- NIST Atomic Spectra Database - Ground states and ionization energies (on physics web site)
- Gas Phase Kinetics Database
- X-ray Photoelectron Spectroscopy Database, version 5.0

Condensed phase thermochemistry data

Quantity | Value | Units | Method | Reference | Comment |
---|---|---|---|---|---|
ΔfH°liquid | 7.79 | kJ/mol | Review | Chase, 1998 | Data last reviewed in September, 1983 |
Quantity | Value | Units | Method | Reference | Comment |
S°liquid,1 bar | 45.51 | J/mol*K | Review | Chase, 1998 | Data last reviewed in September, 1983 |
Quantity | Value | Units | Method | Reference | Comment |
S°solid,1 bar | 41.59 ± 0.40 | J/mol*K | Review | Cox, Wagman, et al., 1984 | CODATA Review value |
Liquid Phase Heat Capacity (Shomate Equation)
Cp° = A + B*t + C*t2 + D*t3 +
E/t2
H° − H°298.15= A*t + B*t2/2 +
C*t3/3 + D*t4/4 − E/t + F − H
S° = A*ln(t) + B*t + C*t2/2 + D*t3/3 −
E/(2*t2) + G
Cp = heat capacity (J/mol*K)
H° = standard enthalpy (kJ/mol)
S° = standard entropy (J/mol*K)
t = temperature (K) / 1000.
View plot Requires a JavaScript / HTML 5 canvas capable browser.
Temperature (K) | 1115. to 1773.658 |
---|---|
A | 35.00004 |
B | 1.119602×10-10 |
C | -8.292981×10-11 |
D | 1.878880×10-11 |
E | 1.912569×10-12 |
F | -2.646946 |
G | 87.86609 |
H | 7.788015 |
Reference | Chase, 1998 |
Comment | Data last reviewed in September, 1983 |
Solid Phase Heat Capacity (Shomate Equation)
Cp° = A + B*t + C*t2 + D*t3 +
E/t2
H° − H°298.15= A*t + B*t2/2 +
C*t3/3 + D*t4/4 − E/t + F − H
S° = A*ln(t) + B*t + C*t2/2 + D*t3/3 −
E/(2*t2) + G
Cp = heat capacity (J/mol*K)
H° = standard enthalpy (kJ/mol)
S° = standard entropy (J/mol*K)
t = temperature (K) / 1000.
View plot Requires a JavaScript / HTML 5 canvas capable browser.
Temperature (K) | 298. to 1100. | 298. to 716. | 716. to 1115. |
---|---|---|---|
A | 19.77517 | 11.11735 | -40.63785 |
B | 10.10813 | 38.52364 | 126.7765 |
C | 14.50338 | -8.891419 | -69.73891 |
D | -5.529491 | -9.618305 | 17.93162 |
E | 0.178031 | 0.391850 | 5.409494 |
F | -5.862997 | -2.563503 | 24.49192 |
G | 62.91606 | 47.71852 | -15.67297 |
H | 0.000000 | 1.056001 | 1.056001 |
Reference | Chase, 1998 | Chase, 1998 | Chase, 1998 |
Comment | α phase; Data last reviewed in September, 1983 | β phase; Data last reviewed in September, 1983 | β phase; Data last reviewed in September, 1983 |

Phase change data

Data compiled as indicated in comments:
TRC - Thermodynamics Research Center, NIST Boulder Laboratories, Chris Muzny director
Quantity | Value | Units | Method | Reference | Comment |
---|---|---|---|---|---|
Tboil | 1757. | K | N/A | Honig and Kramer, 1969 | Uncertainty assigned by TRC = 2. K; TRC |
Quantity | Value | Units | Method | Reference | Comment |
Ttriple | 1112.9 | K | N/A | Honig and Kramer, 1969 | Uncertainty assigned by TRC = 2. K; TRC |
Antoine Equation Parameters
log10(P) = A − (B / (T + C))
P = vapor pressure (bar)
T = temperature (K)
View plot Requires a JavaScript / HTML 5 canvas capable browser.
Temperature (K) | A | B | C | Reference | Comment |
---|---|---|---|---|---|
1254. to 1712. | 2.78473 | 3121.368 | -594.591 | Hartmann and Schneider, 1929 | Coefficents calculated by NIST from author's data. |

Gas phase ion energetics data

Data evaluated as indicated in comments:
L - Sharon G. Lias
Data compiled as indicated in comments:
LL - Sharon G. Lias and Joel F. Liebman
LBLHLM - Sharon G. Lias, John E. Bartmess, Joel F. Liebman, John L. Holmes, Rhoda D. Levin, and W. Gary Mallard
LLK - Sharon G. Lias, Rhoda D. Levin, and Sherif A. Kafafi
RDSH - Henry M. Rosenstock, Keith Draxl, Bruce W. Steiner, and John T. Herron
B - John E. Bartmess
Quantity | Value | Units | Method | Reference | Comment |
---|---|---|---|---|---|
IE (evaluated) | 6.11316 ± 0.00002 | eV | N/A | N/A | L |
Electron affinity determinations
EA (eV) | Method | Reference | Comment |
---|---|---|---|
0.024546 ± 0.000087 | LPES | Petrunin, Andersen, et al., 1996 | B |
0.0184 ± 0.0025 | LPD | Walter and Peterson, 1992 | B |
0.0175 ± 0.0030 | EFD | Nadeau, Zhao, et al., 1992 | B |
0.0430 ± 0.0070 | LPD | Pegg, Thompson, et al., 1987 | B |
Ionization energy determinations
IE (eV) | Method | Reference | Comment |
---|---|---|---|
6.11316 | EVAL | Lide, 1992 | LL |
6.0 ± 0.3 | EI | Lau and Hildenbrand, 1990 | LL |
6.11316 | S | Kelly, 1987 | LBLHLM |
6.11316 ± 0.00002 | S | Sugar and Corliss, 1985 | LBLHLM |
6.08 ± 0.06 | EI | Rauh and Ackermann, 1979 | LLK |
6.0 ± 0.3 | EI | Kleinschmidt and Hildenbrand, 1978 | LLK |
6.06 ± 0.05 | EI | Rauh and Ackermann, 1974 | LLK |
6.11316 ± 0.00002 | S | Brown, Tilford, et al., 1973 | LLK |
~6.1 | EI | Okudaira, 1970 | RDSH |
6.113 | S | Moore, 1970 | RDSH |
6.11313 | S | Risberg, 1968 | RDSH |
6.21 ± 0.09 | SI | Zinkiewicz, 1553 | RDSH |

Gas phase thermochemistry data

Quantity | Value | Units | Method | Reference | Comment |
---|---|---|---|---|---|
ΔfH°gas | 177.8 ± 0.8 | kJ/mol | Review | Cox, Wagman, et al., 1984 | CODATA Review value |
ΔfH°gas | 177.80 | kJ/mol | Review | Chase, 1998 | Data last reviewed in September, 1983 |
Quantity | Value | Units | Method | Reference | Comment |
S°gas,1 bar | 154.887 ± 0.004 | J/mol*K | Review | Cox, Wagman, et al., 1984 | CODATA Review value |
S°gas,1 bar | 154.89 | J/mol*K | Review | Chase, 1998 | Data last reviewed in September, 1983 |
Gas Phase Heat Capacity (Shomate Equation)
Cp° = A + B*t + C*t2 + D*t3 +
E/t2
H° − H°298.15= A*t + B*t2/2 +
C*t3/3 + D*t4/4 − E/t + F − H
S° = A*ln(t) + B*t + C*t2/2 + D*t3/3 −
E/(2*t2) + G
Cp = heat capacity (J/mol*K)
H° = standard enthalpy (kJ/mol)
S° = standard entropy (J/mol*K)
t = temperature (K) / 1000.
View plot Requires a JavaScript / HTML 5 canvas capable browser.
Temperature (K) | 1774. to 6000. |
---|---|
A | 121.5470 |
B | -74.95390 |
C | 19.17230 |
D | -1.400821 |
E | -64.51340 |
F | 42.23540 |
G | 217.4470 |
H | 177.8000 |
Reference | Chase, 1998 |
Comment | Data last reviewed in September, 1983 |

Reaction thermochemistry data

Data compiled by: John E. Bartmess
Individual Reactions
(CAS Reg. No. 56977-48-1 • 4294967295) +
= CAS Reg. No. 56977-48-1
By formula: (CAS Reg. No. 56977-48-1 • 4294967295Ca) + Ca = CAS Reg. No. 56977-48-1
Quantity | Value | Units | Method | Reference | Comment |
---|---|---|---|---|---|
ΔrH° | 183. ± 6.3 | kJ/mol | N/A | Rackwitz, Feldman, et al., 1977 | gas phase |

References

Chase, 1998
Chase, M.W., Jr.,
NIST-JANAF Themochemical Tables, Fourth Edition,
J. Phys. Chem. Ref. Data, Monograph 9, 1998, 1-1951. [all data]
Cox, Wagman, et al., 1984
Cox, J.D.; Wagman, D.D.; Medvedev, V.A.,
CODATA Key Values for Thermodynamics, Hemisphere Publishing Corp., New York, 1984, 1. [all data]
Honig and Kramer, 1969
Honig, R.E.; Kramer, D.A.,
Vapor pressure data for the solid and liquid elements,
RCA Rev., 1969, 1969, 285. [all data]
Hartmann and Schneider, 1929
Hartmann, H.; Schneider, R.,
Die Siedetemperaturen von Magnesium, Calcium, Strontium, Barium and Lithium,
Z. Anorg. Allg. Chem., 1929, 180, 1, 275-283, https://doi.org/10.1002/zaac.19291800129
. [all data]
Petrunin, Andersen, et al., 1996
Petrunin, V.V.; Andersen, H.H.; Balling, P.; Andersen, T.,
Structural Properties of the Negative Calcium Ion: Binding Energies and Fine-structure Splitting,
Phys. Rev. Lett., 1996, 76, 5, 744, https://doi.org/10.1103/PhysRevLett.76.744
. [all data]
Walter and Peterson, 1992
Walter, C.W.; Peterson, J.R.,
Shape Resonance in Ca- Photodetachment and the Electron Affinity of Ca(1S),
Phys. Rev. Lett., 1992, 68, 15, 2281, https://doi.org/10.1103/PhysRevLett.68.2281
. [all data]
Nadeau, Zhao, et al., 1992
Nadeau, M.J.; Zhao, X.L.; Garwan, M.A.; Litherland, A.E.,
Ca Negative-Ion Binding Energy,
Phys. Rev. A, 1992, 46, 7, R3588, https://doi.org/10.1103/PhysRevA.46.R3588
. [all data]
Pegg, Thompson, et al., 1987
Pegg, D.J.; Thompson, J.S.; Compton, R.N.; Alton, G.D.,
Evidence for a Stable Negative Ion of Calcium,
Phys. Rev. Lett., 1987, 59, 20, 2267, https://doi.org/10.1103/PhysRevLett.59.2267
. [all data]
Lide, 1992
Lide, D.R. (Editor),
Ionization potentials of atoms and atomic ions
in Handbook of Chem. and Phys., 1992, 10-211. [all data]
Lau and Hildenbrand, 1990
Lau, K.H.; Hildenbrand, D.L.,
High-temperature equilibrium studies of the gaseous thorium chlorides,
J. Chem. Phys., 1990, 92, 6124. [all data]
Kelly, 1987
Kelly, R.L.,
Atomic and ionic spectrum lines of hydrogen through kryton,
J. Phys. Chem. Ref. Data, 1987, 16. [all data]
Sugar and Corliss, 1985
Sugar, J.; Corliss, C.,
Atomic energy levels of the iron period elements: Potassium through nickel,
J. Phys. Chem. Ref. Data, 1985, 14. [all data]
Rauh and Ackermann, 1979
Rauh, E.G.; Ackermann, R.J.,
The first ionization potentials of the transition metals,
J. Chem. Phys., 1979, 70, 1004. [all data]
Kleinschmidt and Hildenbrand, 1978
Kleinschmidt, P.D.; Hildenbrand, D.L.,
Dissociation energies of CaI, SrI, and BaI from high temperature mass spectrometry,
J. Chem. Phys., 1978, 68, 2819. [all data]
Rauh and Ackermann, 1974
Rauh, E.G.; Ackermann, R.J.,
First ionization potentials of some refractory oxide vapors,
J. Chem. Phys., 1974, 60, 1396. [all data]
Brown, Tilford, et al., 1973
Brown, C.M.; Tilford, S.G.; Ginter, M.L.,
Absorption spectrum of Ca I in the 1580-2090A region,
J. Opt. Soc. Am., 1973, 63, 1454. [all data]
Okudaira, 1970
Okudaira, S.,
Multiple ionization of Ca, Sr and Ba by electron impact,
J. Phys. Soc. Jpn., 1970, 29, 409. [all data]
Moore, 1970
Moore, C.E.,
Ionization potentials and ionization limits derived from the analyses of optical spectra,
Natl. Stand. Ref. Data Ser., (U.S. Natl. Bur. Stand.), 1970, 34, 1. [all data]
Risberg, 1968
Risberg, G.,
The spectrum of atomic calcium, Ca I, and extensions to the analysis of Ca II,
Ark. Fys., 1968, 37, 231. [all data]
Zinkiewicz, 1553
Zinkiewicz, J.M.,
Determination of the ionization potential of Ca and Mg atoms by the surface ionization method using a mass spectrometer,
Proc. Colloq. Spectros. Intern., 14th Debrecen, Hung., 1967,, 1553, 3. [all data]