zinc
- Formula: Zn
- Molecular weight: 65.38
- IUPAC Standard InChIKey: HCHKCACWOHOZIP-UHFFFAOYSA-N
- CAS Registry Number: 7440-66-6
- Chemical structure:
- NIST Atomic Spectra Database - Lines Holdings (on physics web site)
- NIST Atomic Spectra Database - Levels Holdings (on physics web site)
- NIST Atomic Spectra Database - Ground states and ionization energies (on physics web site)
- Gas Phase Kinetics Database
- X-ray Photoelectron Spectroscopy Database, version 5.0

Condensed phase thermochemistry data

Quantity | Value | Units | Method | Reference | Comment |
---|---|---|---|---|---|
ΔfH°liquid | 6.52 | kJ/mol | Review | Chase, 1998 | Data last reviewed in December, 1978 |
Quantity | Value | Units | Method | Reference | Comment |
S°liquid,1 bar | 50.79 | J/mol*K | Review | Chase, 1998 | Data last reviewed in December, 1978 |
Quantity | Value | Units | Method | Reference | Comment |
S°solid,1 bar | 41.63 ± 0.15 | J/mol*K | Review | Cox, Wagman, et al., 1984 | CODATA Review value |
Quantity | Value | Units | Method | Reference | Comment |
S°solid | 41.72 | J/mol*K | Review | Chase, 1998 | Data last reviewed in December, 1978 |
Liquid Phase Heat Capacity (Shomate Equation)
Cp° = A + B*t + C*t2 + D*t3 +
E/t2
H° − H°298.15= A*t + B*t2/2 +
C*t3/3 + D*t4/4 − E/t + F − H
S° = A*ln(t) + B*t + C*t2/2 + D*t3/3 −
E/(2*t2) + G
Cp = heat capacity (J/mol*K)
H° = standard enthalpy (kJ/mol)
S° = standard entropy (J/mol*K)
t = temperature (K) / 1000.
View plot Requires a JavaScript / HTML 5 canvas capable browser.
Temperature (K) | 692.73 to 1180.173 |
---|---|
A | 31.38004 |
B | -9.647635×10-9 |
C | 6.798541×10-9 |
D | -1.574453×10-9 |
E | -3.249003×10-10 |
F | -3.590873 |
G | 86.68160 |
H | 6.519007 |
Reference | Chase, 1998 |
Comment | Data last reviewed in December, 1978 |
Solid Phase Heat Capacity (Shomate Equation)
Cp° = A + B*t + C*t2 + D*t3 +
E/t2
H° − H°298.15= A*t + B*t2/2 +
C*t3/3 + D*t4/4 − E/t + F − H
S° = A*ln(t) + B*t + C*t2/2 + D*t3/3 −
E/(2*t2) + G
Cp = heat capacity (J/mol*K)
H° = standard enthalpy (kJ/mol)
S° = standard entropy (J/mol*K)
t = temperature (K) / 1000.
View plot Requires a JavaScript / HTML 5 canvas capable browser.
Temperature (K) | 298. to 692.73 |
---|---|
A | 25.60123 |
B | -4.405292 |
C | 20.42206 |
D | -7.399697 |
E | -0.045801 |
F | -7.755964 |
G | 72.91373 |
H | 0.000000 |
Reference | Chase, 1998 |
Comment | Data last reviewed in December, 1978 |

Phase change data

Data compiled by: Thermodynamics Research Center, NIST Boulder Laboratories, Chris Muzny director
Quantity | Value | Units | Method | Reference | Comment |
---|---|---|---|---|---|
Tfus | 965.74 | K | N/A | Anonymous, 1988 | Uncertainty assigned by TRC = 0.05 K; nominal value, from the catalog |
Tfus | 692.65 | K | N/A | Anonymous, 1988 | Uncertainty assigned by TRC = 0.1 K; nominal value, from the catalog |
Tfus | 692.83 | K | N/A | Callanan, Sullivan, et al., 1985 | Uncertainty assigned by TRC = 0.3 K |

Gas phase ion energetics data

Data evaluated as indicated in comments:
HL - Edward P. Hunter and Sharon G. Lias
L - Sharon G. Lias
Data compiled as indicated in comments:
LL - Sharon G. Lias and Joel F. Liebman
LBLHLM - Sharon G. Lias, John E. Bartmess, Joel F. Liebman, John L. Holmes, Rhoda D. Levin, and W. Gary Mallard
LLK - Sharon G. Lias, Rhoda D. Levin, and Sherif A. Kafafi
RDSH - Henry M. Rosenstock, Keith Draxl, Bruce W. Steiner, and John T. Herron
Quantity | Value | Units | Method | Reference | Comment |
---|---|---|---|---|---|
IE (evaluated) | 9.39405 | eV | N/A | N/A | L |
Quantity | Value | Units | Method | Reference | Comment |
Proton affinity (review) | 608.6 | kJ/mol | N/A | Hunter and Lias, 1998 | HL |
Quantity | Value | Units | Method | Reference | Comment |
Gas basicity | 586.0 | kJ/mol | N/A | Hunter and Lias, 1998 | HL |
Ionization energy determinations
IE (eV) | Method | Reference | Comment |
---|---|---|---|
9.39405 | EVAL | Lide, 1992 | LL |
9.3942 | S | Kelly, 1987 | LBLHLM |
9.39420 ± 0.00002 | S | Brown, Tilford, et al., 1975 | LLK |
9.57 ± 0.07 | EI | Cabaud, Hoareau, et al., 1972 | LLK |
9.394 | S | Moore, 1970 | RDSH |
9.39405 | S | Johansson and Contreras, 1968 | RDSH |

Gas phase thermochemistry data

Quantity | Value | Units | Method | Reference | Comment |
---|---|---|---|---|---|
ΔfH°gas | 31.166 ± 0.096 | kcal/mol | Review | Cox, Wagman, et al., 1984 | CODATA Review value |
ΔfH°gas | 31.171 | kcal/mol | Review | Chase, 1998 | Data last reviewed in December, 1978 |
Quantity | Value | Units | Method | Reference | Comment |
S°gas,1 bar | 38.4775 ± 0.001 | cal/mol*K | Review | Cox, Wagman, et al., 1984 | CODATA Review value |
S°gas,1 bar | 38.478 | cal/mol*K | Review | Chase, 1998 | Data last reviewed in December, 1978 |
Gas Phase Heat Capacity (Shomate Equation)
Cp° = A + B*t + C*t2 + D*t3 +
E/t2
H° − H°298.15= A*t + B*t2/2 +
C*t3/3 + D*t4/4 − E/t + F − H
S° = A*ln(t) + B*t + C*t2/2 + D*t3/3 −
E/(2*t2) + G
Cp = heat capacity (cal/mol*K)
H° = standard enthalpy (kcal/mol)
S° = standard entropy (cal/mol*K)
t = temperature (K) / 1000.
View plot Requires a JavaScript / HTML 5 canvas capable browser.
Temperature (K) | 1180.173 to 6000. |
---|---|
A | 4.350302 |
B | 0.553059 |
C | -0.176039 |
D | 0.019108 |
E | 0.256586 |
F | 30.33910 |
G | 44.14381 |
H | 31.17120 |
Reference | Chase, 1998 |
Comment | Data last reviewed in December, 1978 |

References

Chase, 1998
Chase, M.W., Jr.,
NIST-JANAF Themochemical Tables, Fourth Edition,
J. Phys. Chem. Ref. Data, Monograph 9, 1998, 1-1951. [all data]
Cox, Wagman, et al., 1984
Cox, J.D.; Wagman, D.D.; Medvedev, V.A.,
CODATA Key Values for Thermodynamics, Hemisphere Publishing Corp., New York, 1984, 1. [all data]
Anonymous, 1988
Anonymous, X.,
, NBS Spec. Publ. (U. S.) 260, 1988. [all data]
Callanan, Sullivan, et al., 1985
Callanan, J.E.; Sullivan, S.A.; Vecchia, D.F.,
Feasibility Study for the Development of Standards Using Differential Scanning Calorimetry, Natl. Bur. Stand. Spec. Publ. 260-99 1985, 1985. [all data]
Hunter and Lias, 1998
Hunter, E.P.; Lias, S.G.,
Evaluated Gas Phase Basicities and Proton Affinities of Molecules: An Update,
J. Phys. Chem. Ref. Data, 1998, 27, 3, 413-656, https://doi.org/10.1063/1.556018
. [all data]
Lide, 1992
Lide, D.R. (Editor),
Ionization potentials of atoms and atomic ions
in Handbook of Chem. and Phys., 1992, 10-211. [all data]
Kelly, 1987
Kelly, R.L.,
Atomic and ionic spectrum lines of hydrogen through kryton,
J. Phys. Chem. Ref. Data, 1987, 16. [all data]
Brown, Tilford, et al., 1975
Brown, C.M.; Tilford, S.G.; Ginter, M.L.,
Absorption spectra of Zn I Cd and I in the 1300-1750 A region,
J. Opt. Soc. Am., 1975, 65, 1404. [all data]
Cabaud, Hoareau, et al., 1972
Cabaud, B.; Hoareau, A.; Nounou, P.; Uzan, R.,
Etude des processus d'ionisation a haute temperature des vapeurs metalliques par couplage d'une cellule de knudsen et d'une source fox. II. Interpretation des processus d'autoionisation des vapeurs metalliques monoatomiques et influence delatemperature sur les courbes d'efficacite d'ionisation.,
Int. J. Mass Spectrom. Ion Phys., 1972, 8, 181. [all data]
Moore, 1970
Moore, C.E.,
Ionization potentials and ionization limits derived from the analyses of optical spectra,
Natl. Stand. Ref. Data Ser., (U.S. Natl. Bur. Stand.), 1970, 34, 1. [all data]
Johansson and Contreras, 1968
Johansson, I.; Contreras, R.,
New measurements in the arc spectrum of zinc,
Ark. Fys., 1968, 37, 513. [all data]