germanium
- Formula: Ge
- Molecular weight: 72.64
- IUPAC Standard InChIKey: GNPVGFCGXDBREM-UHFFFAOYSA-N
- CAS Registry Number: 7440-56-4
- Chemical structure:
- NIST Atomic Spectra Database - Lines Holdings (on physics web site)
- NIST Atomic Spectra Database - Levels Holdings (on physics web site)
- NIST Atomic Spectra Database - Ground states and ionization energies (on physics web site)
- Gas Phase Kinetics Database
- X-ray Photoelectron Spectroscopy Database, version 5.0

Condensed phase thermochemistry data

Quantity | Value | Units | Method | Reference | Comment |
---|---|---|---|---|---|
S°solid,1 bar | 31.09 ± 0.15 | J/mol*K | Review | Cox, Wagman, et al., 1984 | CODATA Review value |

Reaction thermochemistry data

Data compiled as indicated in comments:
MS - José A. Martinho Simões
B - John E. Bartmess
Individual Reactions
HGe (g) = (g) +
(g)
By formula: HGe (g) = H (g) + Ge (g)
Quantity | Value | Units | Method | Reference | Comment |
---|---|---|---|---|---|
ΔrH° | >225. | kJ/mol | PIMS | Ruscic, Schwarz, et al., 1990 | Temperature: 0 K. A value of 264. kJ/mol is recommended in Ruscic, Schwarz, et al., 1990.; MS |
(CAS Reg. No. 64177-44-2 • 4294967295) +
= CAS Reg. No. 64177-44-2
By formula: (CAS Reg. No. 64177-44-2 • 4294967295Ge) + Ge = CAS Reg. No. 64177-44-2
Quantity | Value | Units | Method | Reference | Comment |
---|---|---|---|---|---|
ΔrH° | 341. ± 10. | kJ/mol | N/A | Arnold, Xu, et al., 1995 | gas phase; B |
By formula: (Ge3- • 4294967295Ge) + Ge = Ge3-
Quantity | Value | Units | Method | Reference | Comment |
---|---|---|---|---|---|
ΔrH° | 386. ± 10. | kJ/mol | N/A | Burton, Xu, et al., 1996 | gas phase; B |
(CAS Reg. No. 78413-15-7 • 4294967295) +
= CAS Reg. No. 78413-15-7
By formula: (CAS Reg. No. 78413-15-7 • 4294967295Ge) + Ge = CAS Reg. No. 78413-15-7
Quantity | Value | Units | Method | Reference | Comment |
---|---|---|---|---|---|
ΔrH° | 335. ± 5.9 | kJ/mol | N/A | Burton, Xu, et al., 1996 | gas phase; B |

Gas phase ion energetics data

Data evaluated as indicated in comments:
L - Sharon G. Lias
Data compiled as indicated in comments:
LL - Sharon G. Lias and Joel F. Liebman
LBLHLM - Sharon G. Lias, John E. Bartmess, Joel F. Liebman, John L. Holmes, Rhoda D. Levin, and W. Gary Mallard
LLK - Sharon G. Lias, Rhoda D. Levin, and Sherif A. Kafafi
RDSH - Henry M. Rosenstock, Keith Draxl, Bruce W. Steiner, and John T. Herron
B - John E. Bartmess
Quantity | Value | Units | Method | Reference | Comment |
---|---|---|---|---|---|
IE (evaluated) | 7.899 ± 0.001 | eV | N/A | N/A | L |
Electron affinity determinations
EA (eV) | Method | Reference | Comment |
---|---|---|---|
1.232713 ± 0.000044 | LPD | Scheer, Bilodeau, et al., 1998 | Given: 1.232712(15) eV; B |
1.2330 ± 0.0030 | LPES | Miller, Miller, et al., 1986 | B |
Ionization energy determinations
IE (eV) | Method | Reference | Comment |
---|---|---|---|
7.900 | EVAL | Lide, 1992 | LL |
7.899 | S | Kelly, 1987 | LBLHLM |
7.89944 ± 0.00002 | S | Brown, Tilford, et al., 1977 | LLK |
7.8 ± 0.5 | EI | Muenow, 1974 | LLK |
8.0 ± 0.3 | EI | Hildenbrand, 1972 | LLK |
7.900 | S | Moore, 1970 | RDSH |

Gas phase thermochemistry data

Quantity | Value | Units | Method | Reference | Comment |
---|---|---|---|---|---|
ΔfH°gas | 372. ± 8. | kJ/mol | Review | Cox, Wagman, et al., 1984 | CODATA Review value |
Quantity | Value | Units | Method | Reference | Comment |
S°gas,1 bar | 167.904 ± 0.005 | J/mol*K | Review | Cox, Wagman, et al., 1984 | CODATA Review value |

Ion clustering data

Data compiled by: John E. Bartmess
Clustering reactions
By formula: (Ge3- • 4294967295Ge) + Ge = Ge3-
Quantity | Value | Units | Method | Reference | Comment |
---|---|---|---|---|---|
ΔrH° | 386. ± 10. | kJ/mol | N/A | Burton, Xu, et al., 1996 | gas phase |

References

Cox, Wagman, et al., 1984
Cox, J.D.; Wagman, D.D.; Medvedev, V.A.,
CODATA Key Values for Thermodynamics, Hemisphere Publishing Corp., New York, 1984, 1. [all data]
Ruscic, Schwarz, et al., 1990
Ruscic, B.; Schwarz, M.; Berkowitz, J.,
Photoionization studies of GeHn(n = 2-4),
J. Chem. Phys., 1990, 92, 1865. [all data]
Arnold, Xu, et al., 1995
Arnold, C.C.; Xu, C.S.; Burton, G.R.; Neumark, D.M.,
Study of the low-lying states of Ge-2 and Ge-2(-) using negative ion zero electron kinetic energy spectroscopy,
J. Chem. Phys., 1995, 102, 18, 6982, https://doi.org/10.1063/1.469091
. [all data]
Burton, Xu, et al., 1996
Burton, G.R.; Xu, C.; Arnold, C.C.; Neumark, D.M.,
Photoelectron Spectroscopy and Zero Kinetic Energy Spectroscopy of Germanium Cluster Anions,
J. Chem. Phys., 1996, 104, 8, 2757, https://doi.org/10.1063/1.471098
. [all data]
Scheer, Bilodeau, et al., 1998
Scheer, M.; Bilodeau, R.C.; Brodie, C.A.; Haugen, H.K.,
Systematic study of the stable states of C-, Si-, Ge-, and Sn- via infrared laser spectroscopy,
Phys. Rev. A, 1998, 58, 4, 2844-2856, https://doi.org/10.1103/PhysRevA.58.2844
. [all data]
Miller, Miller, et al., 1986
Miller, T.M.; Miller, A.E.S.; Lineberger, W.C.,
Electron Affinities of Ge and Sn,
Phys. Rev. A, 1986, 33, 5, 3558, https://doi.org/10.1103/PhysRevA.33.3558
. [all data]
Lide, 1992
Lide, D.R. (Editor),
Ionization potentials of atoms and atomic ions
in Handbook of Chem. and Phys., 1992, 10-211. [all data]
Kelly, 1987
Kelly, R.L.,
Atomic and ionic spectrum lines of hydrogen through kryton,
J. Phys. Chem. Ref. Data, 1987, 16. [all data]
Brown, Tilford, et al., 1977
Brown, C.M.; Tilford, S.G.; Ginter, M.L.,
Absorption spectrum of Ge I between 1500 and 1900 Å,
J. Opt. Soc. Am., 1977, 67, 584. [all data]
Muenow, 1974
Muenow, D.W.,
Mass spectrometric determination of the heats of formation and atomization energies of the molecules Ge2N and GeSiN,
J. Chem. Phys., 1974, 60, 3382. [all data]
Hildenbrand, 1972
Hildenbrand, D.L.,
The gaseous equilibrium Ge + SiO = GeO + Si and the dissociation energy of SiO,
High Temp. Sci., 1972, 4, 244. [all data]
Moore, 1970
Moore, C.E.,
Ionization potentials and ionization limits derived from the analyses of optical spectra,
Natl. Stand. Ref. Data Ser., (U.S. Natl. Bur. Stand.), 1970, 34, 1. [all data]