cadmium
- Formula: Cd
- Molecular weight: 112.411
- IUPAC Standard InChIKey: BDOSMKKIYDKNTQ-UHFFFAOYSA-N
- CAS Registry Number: 7440-43-9
- Chemical structure:
- NIST Atomic Spectra Database - Lines Holdings (on physics web site)
- NIST Atomic Spectra Database - Levels Holdings (on physics web site)
- NIST Atomic Spectra Database - Ground states and ionization energies (on physics web site)
- Gas Phase Kinetics Database
- X-ray Photoelectron Spectroscopy Database, version 5.0

Condensed phase thermochemistry data

Quantity | Value | Units | Method | Reference | Comment |
---|---|---|---|---|---|
S°solid,1 bar | 51.80 ± 0.15 | J/mol*K | Review | Cox, Wagman, et al., 1984 | CODATA Review value |

Gas phase ion energetics data

Data evaluated as indicated in comments:
L - Sharon G. Lias
Data compiled as indicated in comments:
LL - Sharon G. Lias and Joel F. Liebman
LLK - Sharon G. Lias, Rhoda D. Levin, and Sherif A. Kafafi
RDSH - Henry M. Rosenstock, Keith Draxl, Bruce W. Steiner, and John T. Herron
Quantity | Value | Units | Method | Reference | Comment |
---|---|---|---|---|---|
IE (evaluated) | 8.9937 ± 0.0001 | eV | N/A | N/A | L |
Ionization energy determinations
IE (eV) | Method | Reference | Comment |
---|---|---|---|
8.99367 | EVAL | Lide, 1992 | LL |
8.99382 ± 0.00002 | S | Brown, Tilford, et al., 1975 | LLK |
9.07 ± 0.07 | EI | Cabaud, Hoareau, et al., 1972 | LLK |
8.99 | CI | Cermak, 1971 | LLK |
8.993 | S | Moore, 1970 | RDSH |

Gas phase thermochemistry data

Quantity Value Units Method Reference Comment
Δfgas111.80 ± 0.20kJ/molReviewCox, Wagman, et al., 1984CODATA Review value
Quantity Value Units Method Reference Comment
gas,1 bar167.749 ± 0.004J/mol*KReviewCox, Wagman, et al., 1984CODATA Review value

References

Cox, Wagman, et al., 1984
Cox, J.D.; Wagman, D.D.; Medvedev, V.A.,
CODATA Key Values for Thermodynamics, Hemisphere Publishing Corp., New York, 1984, 1. [all data]
Lide, 1992
Lide, D.R. (Editor),
Ionization potentials of atoms and atomic ions
in Handbook of Chem. and Phys., 1992, 10-211. [all data]
Brown, Tilford, et al., 1975
Brown, C.M.; Tilford, S.G.; Ginter, M.L.,
Absorption spectra of Zn I Cd and I in the 1300-1750 A region,
J. Opt. Soc. Am., 1975, 65, 1404. [all data]
Cabaud, Hoareau, et al., 1972
Cabaud, B.; Hoareau, A.; Nounou, P.; Uzan, R.,
Etude des processus d'ionisation a haute temperature des vapeurs metalliques par couplage d'une cellule de knudsen et d'une source fox. II. Interpretation des processus d'autoionisation des vapeurs metalliques monoatomiques et influence delatemperature sur les courbes d'efficacite d'ionisation.,
Int. J. Mass Spectrom. Ion Phys., 1972, 8, 181. [all data]
Cermak, 1971
Cermak, V.,
Penning ionization electron spectroscopy. III. Ionization of cadmium,
Collect. Czech. Chem. Commun., 1971, 36, 948. [all data]
Moore, 1970
Moore, C.E.,
Ionization potentials and ionization limits derived from the analyses of optical spectra,
Natl. Stand. Ref. Data Ser., (U.S. Natl. Bur. Stand.), 1970, 34, 1. [all data]