boron
- Formula: B
- Molecular weight: 10.811
- IUPAC Standard InChIKey: ZOXJGFHDIHLPTG-UHFFFAOYSA-N
- CAS Registry Number: 7440-42-8
- Chemical structure:
- NIST Atomic Spectra Database - Lines Holdings (on physics web site)
- NIST Atomic Spectra Database - Levels Holdings (on physics web site)
- NIST Atomic Spectra Database - Ground states and ionization energies (on physics web site)
- Electron-Impact Ionization Cross Sections (on physics web site)
- Gas Phase Kinetics Database
- X-ray Photoelectron Spectroscopy Database, version 5.0
- X-ray Photoelectron Spectroscopy Database, version 5.0

Gas phase thermochemistry data

Quantity | Value | Units | Method | Reference | Comment |
---|---|---|---|---|---|
ΔfH°gas | 565. ± 5. | kJ/mol | Review | Cox, Wagman, et al., 1984 | CODATA Review value |
ΔfH°gas | 560.00 | kJ/mol | Review | Chase, 1998 | Data last reviewed in June, 1983 |
Quantity | Value | Units | Method | Reference | Comment |
S°gas,1 bar | 153.436 ± 0.015 | J/mol*K | Review | Cox, Wagman, et al., 1984 | CODATA Review value |
S°gas,1 bar | 153.44 | J/mol*K | Review | Chase, 1998 | Data last reviewed in June, 1983 |
Gas Phase Heat Capacity (Shomate Equation)
Cp° = A + B*t + C*t2 + D*t3 +
E/t2
H° − H°298.15= A*t + B*t2/2 +
C*t3/3 + D*t4/4 − E/t + F − H
S° = A*ln(t) + B*t + C*t2/2 + D*t3/3 −
E/(2*t2) + G
Cp = heat capacity (J/mol*K)
H° = standard enthalpy (kJ/mol)
S° = standard entropy (J/mol*K)
t = temperature (K) / 1000.
View plot Requires a JavaScript / HTML 5 canvas capable browser.
Temperature (K) | 4137.895 to 6000. |
---|---|
A | 20.65193 |
B | 0.226427 |
C | -0.112330 |
D | 0.016889 |
E | 0.008714 |
F | 553.8654 |
G | 178.4179 |
H | 559.9991 |
Reference | Chase, 1998 |
Comment | Data last reviewed in June, 1983 |

Condensed phase thermochemistry data

Quantity | Value | Units | Method | Reference | Comment |
---|---|---|---|---|---|
ΔfH°liquid | 48.93 | kJ/mol | Review | Chase, 1998 | Data last reviewed in June, 1983 |
Quantity | Value | Units | Method | Reference | Comment |
S°liquid,1 bar | 26.54 | J/mol*K | Review | Chase, 1998 | Data last reviewed in June, 1983 |
Quantity | Value | Units | Method | Reference | Comment |
S°solid,1 bar | 5.90 ± 0.08 | J/mol*K | Review | Cox, Wagman, et al., 1984 | rhombic phase; CODATA Review value |
Liquid Phase Heat Capacity (Shomate Equation)
Cp° = A + B*t + C*t2 + D*t3 +
E/t2
H° − H°298.15= A*t + B*t2/2 +
C*t3/3 + D*t4/4 − E/t + F − H
S° = A*ln(t) + B*t + C*t2/2 + D*t3/3 −
E/(2*t2) + G
Cp = heat capacity (J/mol*K)
H° = standard enthalpy (kJ/mol)
S° = standard entropy (J/mol*K)
t = temperature (K) / 1000.
View plot Requires a JavaScript / HTML 5 canvas capable browser.
Temperature (K) | 2350. to 4137.895 |
---|---|
A | 31.75003 |
B | 2.556177×10-7 |
C | -6.456792×10-8 |
D | 5.616644×10-9 |
E | 2.705970×10-7 |
F | 27.94205 |
G | 46.94741 |
H | 48.92686 |
Reference | Chase, 1998 |
Comment | Data last reviewed in June, 1983 |
Solid Phase Heat Capacity (Shomate Equation)
Cp° = A + B*t + C*t2 + D*t3 +
E/t2
H° − H°298.15= A*t + B*t2/2 +
C*t3/3 + D*t4/4 − E/t + F − H
S° = A*ln(t) + B*t + C*t2/2 + D*t3/3 −
E/(2*t2) + G
Cp = heat capacity (J/mol*K)
H° = standard enthalpy (kJ/mol)
S° = standard entropy (J/mol*K)
t = temperature (K) / 1000.
View plot Requires a JavaScript / HTML 5 canvas capable browser.
Temperature (K) | 298. to 1800. | 1800. to 2350. |
---|---|---|
A | 10.18574 | 25.12664 |
B | 29.24415 | 1.975493 |
C | -18.02137 | 0.338395 |
D | 4.212326 | -0.040032 |
E | -0.550999 | -2.635578 |
F | -6.036299 | -14.43597 |
G | 7.089077 | 25.59930 |
H | 0.000000 | 0.000000 |
Reference | Chase, 1998 | Chase, 1998 |
Comment | β-rhombohedral phase; Data last reviewed in June, 1983 | β-rhombohedral phase; Data last reviewed in June, 1983 |

Reaction thermochemistry data

Data compiled as indicated in comments:
M - Michael M. Meot-Ner (Mautner) and Sharon G. Lias
B - John E. Bartmess
Individual Reactions
By formula: (B+ • 10B) + B = (B+ • 11B)
Quantity | Value | Units | Method | Reference | Comment |
---|---|---|---|---|---|
ΔrH° | 531. ± 50. | kJ/mol | CID | Hanley, Whitten, et al., 1988 | gas phase; ΔrH<; M |
By formula: (B+ • 11B) + B = (B+ • 12B)
Quantity | Value | Units | Method | Reference | Comment |
---|---|---|---|---|---|
ΔrH° | 770. ± 150. | kJ/mol | CID | Hanley, Whitten, et al., 1988 | gas phase; ΔrH<; M |
By formula: (B+ • 9B) + B = (B+ • 10B)
Quantity | Value | Units | Method | Reference | Comment |
---|---|---|---|---|---|
ΔrH° | 540. ± 75. | kJ/mol | CID | Hanley, Whitten, et al., 1988 | gas phase; ΔrH<; M |
By formula: (B+ • 2B) + B = (B+ • 3B)
Quantity | Value | Units | Method | Reference | Comment |
---|---|---|---|---|---|
ΔrH° | 770. ± 150. | kJ/mol | CID | Hanley, Whitten, et al., 1988 | gas phase; ΔrH<; M |
By formula: (B+ • 3B) + B = (B+ • 4B)
Quantity | Value | Units | Method | Reference | Comment |
---|---|---|---|---|---|
ΔrH° | 686. ± 59. | kJ/mol | CID | Hanley, Whitten, et al., 1988 | gas phase; ΔrH<; M |
By formula: (B+ • 5B) + B = (B+ • 6B)
Quantity | Value | Units | Method | Reference | Comment |
---|---|---|---|---|---|
ΔrH° | 531. ± 67. | kJ/mol | CID | Hanley, Whitten, et al., 1988 | gas phase; ΔrH<; M |
By formula: (B+ • 8B) + B = (B+ • 9B)
Quantity | Value | Units | Method | Reference | Comment |
---|---|---|---|---|---|
ΔrH° | 523. ± 50. | kJ/mol | CID | Hanley, Whitten, et al., 1988 | gas phase; ΔrH<; M |
By formula: (B+ • 4B) + B = (B+ • 5B)
Quantity | Value | Units | Method | Reference | Comment |
---|---|---|---|---|---|
ΔrH° | 260. ± 59. | kJ/mol | CID | Hanley, Whitten, et al., 1988 | gas phase; ΔrH<; M |
By formula: (B+ • 6B) + B = (B+ • 7B)
Quantity | Value | Units | Method | Reference | Comment |
---|---|---|---|---|---|
ΔrH° | 410. ± 50. | kJ/mol | CID | Hanley, Whitten, et al., 1988 | gas phase; ΔrH<; M |
By formula: (B+ • 7B) + B = (B+ • 8B)
Quantity | Value | Units | Method | Reference | Comment |
---|---|---|---|---|---|
ΔrH° | 380. ± 50. | kJ/mol | CID | Hanley, Whitten, et al., 1988 | gas phase; ΔrH<; M |
By formula: (B+ • B) + B = (B+ • 2B)
Quantity | Value | Units | Method | Reference | Comment |
---|---|---|---|---|---|
ΔrH° | 410. ± 67. | kJ/mol | CID | Hanley, Whitten, et al., 1988 | gas phase; ΔrH<; M |
(CAS Reg. No. 12513-02-9 • 4294967295) +
= CAS Reg. No. 12513-02-9
By formula: (CAS Reg. No. 12513-02-9 • 4294967295B) + B = CAS Reg. No. 12513-02-9
Quantity | Value | Units | Method | Reference | Comment |
---|---|---|---|---|---|
ΔrH° | 905. ± 12. | kJ/mol | N/A | Wenthold, Kim, et al., 1997 | gas phase; B |
Quantity | Value | Units | Method | Reference | Comment |
---|---|---|---|---|---|
ΔrH° | 75. ± 59. | kJ/mol | CID | Hanley, Whitten, et al., 1988 | gas phase; ΔrH<; M |

Gas phase ion energetics data

Data evaluated as indicated in comments:
L - Sharon G. Lias
Data compiled as indicated in comments:
LL - Sharon G. Lias and Joel F. Liebman
LBLHLM - Sharon G. Lias, John E. Bartmess, Joel F. Liebman, John L. Holmes, Rhoda D. Levin, and W. Gary Mallard
LLK - Sharon G. Lias, Rhoda D. Levin, and Sherif A. Kafafi
RDSH - Henry M. Rosenstock, Keith Draxl, Bruce W. Steiner, and John T. Herron
B - John E. Bartmess
Quantity | Value | Units | Method | Reference | Comment |
---|---|---|---|---|---|
IE (evaluated) | 8.29803 ± 0.00002 | eV | N/A | N/A | L |
Electron affinity determinations
EA (eV) | Method | Reference | Comment |
---|---|---|---|
0.279743 ± 0.000044 | LPD | Scheer, Bilodeau, et al., 1998 | tunable IR laser; B |
0.278 ± 0.010 | LPES | Feigerle, Corderman, et al., 1981 | B |
<0.500002 | PD | Feldmann, Rackwitz, et al., 1977 | B |
Ionization energy determinations
IE (eV) | Method | Reference | Comment |
---|---|---|---|
8.29803 | EVAL | Lide, 1992 | LL |
8.298 | S | Kelly, 1987 | LBLHLM |
8.0 | EI | Murad and Hildenbrand, 1975 | LLK |
8.29802 ± 0.00002 | S | Brown, Tilford, et al., 1974 | LLK |
8.6 ± 0.4 | EI | Gingerich, 1971 | LLK |
8.298 | S | Moore, 1970 | RDSH |

Ion clustering data

Data compiled by: Michael M. Meot-Ner (Mautner) and Sharon G. Lias
Clustering reactions
Quantity | Value | Units | Method | Reference | Comment |
---|---|---|---|---|---|
ΔrH° | 75. ± 59. | kJ/mol | CID | Hanley, Whitten, et al., 1988 | gas phase; ΔrH< |
By formula: (B+ • B) + B = (B+ • 2B)
Quantity | Value | Units | Method | Reference | Comment |
---|---|---|---|---|---|
ΔrH° | 410. ± 67. | kJ/mol | CID | Hanley, Whitten, et al., 1988 | gas phase; ΔrH< |
By formula: (B+ • 2B) + B = (B+ • 3B)
Quantity | Value | Units | Method | Reference | Comment |
---|---|---|---|---|---|
ΔrH° | 770. ± 150. | kJ/mol | CID | Hanley, Whitten, et al., 1988 | gas phase; ΔrH< |
By formula: (B+ • 3B) + B = (B+ • 4B)
Quantity | Value | Units | Method | Reference | Comment |
---|---|---|---|---|---|
ΔrH° | 686. ± 59. | kJ/mol | CID | Hanley, Whitten, et al., 1988 | gas phase; ΔrH< |
By formula: (B+ • 4B) + B = (B+ • 5B)
Quantity | Value | Units | Method | Reference | Comment |
---|---|---|---|---|---|
ΔrH° | 260. ± 59. | kJ/mol | CID | Hanley, Whitten, et al., 1988 | gas phase; ΔrH< |
By formula: (B+ • 5B) + B = (B+ • 6B)
Quantity | Value | Units | Method | Reference | Comment |
---|---|---|---|---|---|
ΔrH° | 531. ± 67. | kJ/mol | CID | Hanley, Whitten, et al., 1988 | gas phase; ΔrH< |
By formula: (B+ • 6B) + B = (B+ • 7B)
Quantity | Value | Units | Method | Reference | Comment |
---|---|---|---|---|---|
ΔrH° | 410. ± 50. | kJ/mol | CID | Hanley, Whitten, et al., 1988 | gas phase; ΔrH< |
By formula: (B+ • 7B) + B = (B+ • 8B)
Quantity | Value | Units | Method | Reference | Comment |
---|---|---|---|---|---|
ΔrH° | 380. ± 50. | kJ/mol | CID | Hanley, Whitten, et al., 1988 | gas phase; ΔrH< |
By formula: (B+ • 8B) + B = (B+ • 9B)
Quantity | Value | Units | Method | Reference | Comment |
---|---|---|---|---|---|
ΔrH° | 523. ± 50. | kJ/mol | CID | Hanley, Whitten, et al., 1988 | gas phase; ΔrH< |
By formula: (B+ • 9B) + B = (B+ • 10B)
Quantity | Value | Units | Method | Reference | Comment |
---|---|---|---|---|---|
ΔrH° | 540. ± 75. | kJ/mol | CID | Hanley, Whitten, et al., 1988 | gas phase; ΔrH< |
By formula: (B+ • 10B) + B = (B+ • 11B)
Quantity | Value | Units | Method | Reference | Comment |
---|---|---|---|---|---|
ΔrH° | 531. ± 50. | kJ/mol | CID | Hanley, Whitten, et al., 1988 | gas phase; ΔrH< |
By formula: (B+ • 11B) + B = (B+ • 12B)
Quantity | Value | Units | Method | Reference | Comment |
---|---|---|---|---|---|
ΔrH° | 770. ± 150. | kJ/mol | CID | Hanley, Whitten, et al., 1988 | gas phase; ΔrH< |

References

Cox, Wagman, et al., 1984
Cox, J.D.; Wagman, D.D.; Medvedev, V.A.,
CODATA Key Values for Thermodynamics, Hemisphere Publishing Corp., New York, 1984, 1. [all data]
Chase, 1998
Chase, M.W., Jr.,
NIST-JANAF Themochemical Tables, Fourth Edition,
J. Phys. Chem. Ref. Data, Monograph 9, 1998, 1-1951. [all data]
Hanley, Whitten, et al., 1988
Hanley, L.; Whitten, J.L.; Anderson, S.L.,
Collision - Induced Dissociation and ab initio Studies of Boron Cluster Ions. Determination of Structures and Stabilities,
J. Phys. Chem., 1988, 92, 20, 5803, https://doi.org/10.1021/j100331a052
. [all data]
Wenthold, Kim, et al., 1997
Wenthold, P.G.; Kim, J.B.; Jonas, K.-L.; Lineberger, W.C.,
An Experimental and Computational Study of the Electron Affinity of Boron Oxide,
J. Phys. Chem. A, 1997, 101, 24, 4472, https://doi.org/10.1021/jp970645u
. [all data]
Scheer, Bilodeau, et al., 1998
Scheer, M.; Bilodeau, R.C.; Haugen, H.K.,
Negative ion of boron: An experimental study of the P-3 ground state,
Phys. Rev. Lett., 1998, 80, 12, 2562-2565, https://doi.org/10.1103/PhysRevLett.80.2562
. [all data]
Feigerle, Corderman, et al., 1981
Feigerle, C.S.; Corderman, R.R.; Lineberger, W.C.,
Electron affinities of B, Al, Bi, and Pb,
J. Chem. Phys., 1981, 74, 2, 1513, https://doi.org/10.1063/1.441174
. [all data]
Feldmann, Rackwitz, et al., 1977
Feldmann, D.; Rackwitz, R.; Heincke, H.; Kaiser, H.J.,
Photoabsolung von Elektronen der Ionen B-, Ga-, In-, Tl-, Ge-, und Pb-,
Z. Naturforschung A, 1977, 32, 302. [all data]
Lide, 1992
Lide, D.R. (Editor),
Ionization potentials of atoms and atomic ions
in Handbook of Chem. and Phys., 1992, 10-211. [all data]
Kelly, 1987
Kelly, R.L.,
Atomic and ionic spectrum lines of hydrogen through kryton,
J. Phys. Chem. Ref. Data, 1987, 16. [all data]
Murad and Hildenbrand, 1975
Murad, E.; Hildenbrand, D.L.,
Thermochemical properties of gaseous ZrO and ZrO2,
J. Chem. Phys., 1975, 63, 1133. [all data]
Brown, Tilford, et al., 1974
Brown, C.M.; Tilford, S.G.; Ginter, M.L.,
Absorption spectrum of B I in the 1350-1900-A region,
J. Opt. Soc. Am., 1974, 64, 877. [all data]
Gingerich, 1971
Gingerich, K.A.,
Gaseous metal borides. III. The dissociation energy and heat of formation of gold monoboride,
J. Chem. Phys., 1971, 54, 2646. [all data]
Moore, 1970
Moore, C.E.,
Ionization potentials and ionization limits derived from the analyses of optical spectra,
Natl. Stand. Ref. Data Ser., (U.S. Natl. Bur. Stand.), 1970, 34, 1. [all data]