arsenic
- Formula: As
- Molecular weight: 74.92160
- IUPAC Standard InChIKey: RQNWIZPPADIBDY-UHFFFAOYSA-N
- CAS Registry Number: 7440-38-2
- Chemical structure:
- NIST Atomic Spectra Database - Lines Holdings (on physics web site)
- NIST Atomic Spectra Database - Levels Holdings (on physics web site)
- NIST Atomic Spectra Database - Ground states and ionization energies (on physics web site)
- Gas Phase Kinetics Database
- X-ray Photoelectron Spectroscopy Database, version 5.0

Reaction thermochemistry data

Data compiled by: John E. Bartmess
Individual Reactions
(CAS Reg. No. 51680-81-0 • 4294967295) +
= CAS Reg. No. 51680-81-0
By formula: (CAS Reg. No. 51680-81-0 • 4294967295As) + As = CAS Reg. No. 51680-81-0
Quantity | Value | Units | Method | Reference | Comment |
---|---|---|---|---|---|
ΔrH° | 382. ± 4.6 | kJ/mol | N/A | Lippa, Xu, et al., 1998 | gas phase |
(CAS Reg. No. 51680-83-2 • 4294967295) +
= CAS Reg. No. 51680-83-2
By formula: (CAS Reg. No. 51680-83-2 • 4294967295As) + As = CAS Reg. No. 51680-83-2
Quantity | Value | Units | Method | Reference | Comment |
---|---|---|---|---|---|
ΔrH° | 307. ± 17. | kJ/mol | N/A | Lippa, Xu, et al., 1998 | gas phase |

References

Lippa, Xu, et al., 1998
Lippa, T.P.; Xu, S.J.; Lyapustina, S.A.; Nilles, J.M.; Bowen, K.H.,
Photoelectron spectroscopy of As-, As-2(-), As-3(-), As-4(-), and As-5(-),
J. Chem. Phys., 1998, 109, 24, 10727-10731, https://doi.org/10.1063/1.477771
. [all data]