tungsten
- Formula: W
- Molecular weight: 183.84
- IUPAC Standard InChIKey: WFKWXMTUELFFGS-UHFFFAOYSA-N
- CAS Registry Number: 7440-33-7
- Chemical structure:
- NIST Atomic Spectra Database - Lines Holdings (on physics web site)
- NIST Atomic Spectra Database - Levels Holdings (on physics web site)
- NIST Atomic Spectra Database - Ground states and ionization energies (on physics web site)
- Gas Phase Kinetics Database
- X-ray Photoelectron Spectroscopy Database, version 5.0

Condensed phase thermochemistry data

Quantity | Value | Units | Method | Reference | Comment |
---|---|---|---|---|---|
ΔfH°liquid | 46.90 | kJ/mol | Review | Chase, 1998 | Data last reviewed in June, 1966 |
Quantity | Value | Units | Method | Reference | Comment |
S°liquid,1 bar | 45.68 | J/mol*K | Review | Chase, 1998 | Data last reviewed in June, 1966 |
Quantity | Value | Units | Method | Reference | Comment |
S°solid | 32.66 | J/mol*K | Review | Chase, 1998 | Data last reviewed in June, 1966 |
Liquid Phase Heat Capacity (Shomate Equation)
Cp° = A + B*t + C*t2 + D*t3 +
E/t2
H° − H°298.15= A*t + B*t2/2 +
C*t3/3 + D*t4/4 − E/t + F − H
S° = A*ln(t) + B*t + C*t2/2 + D*t3/3 −
E/(2*t2) + G
Cp = heat capacity (J/mol*K)
H° = standard enthalpy (kJ/mol)
S° = standard entropy (J/mol*K)
t = temperature (K) / 1000.
View plot Requires a JavaScript / HTML 5 canvas capable browser.
Temperature (K) | 3680. to 6000. |
---|---|
A | 35.56404 |
B | -1.551741×10-7 |
C | 2.915253×10-8 |
D | -1.891725×10-9 |
E | -4.107702×10-7 |
F | 22.90422 |
G | 72.18572 |
H | 46.89595 |
Reference | Chase, 1998 |
Comment | Data last reviewed in June, 1966 |
Solid Phase Heat Capacity (Shomate Equation)
Cp° = A + B*t + C*t2 + D*t3 +
E/t2
H° − H°298.15= A*t + B*t2/2 +
C*t3/3 + D*t4/4 − E/t + F − H
S° = A*ln(t) + B*t + C*t2/2 + D*t3/3 −
E/(2*t2) + G
Cp = heat capacity (J/mol*K)
H° = standard enthalpy (kJ/mol)
S° = standard entropy (J/mol*K)
t = temperature (K) / 1000.
View plot Requires a JavaScript / HTML 5 canvas capable browser.
Temperature (K) | 298. to 1900. | 1900. to 3680. |
---|---|---|
A | 23.95930 | -22.57640 |
B | 2.639680 | 90.27980 |
C | 1.257750 | -44.27150 |
D | -0.254642 | 7.176630 |
E | -0.048407 | -24.09740 |
F | -7.433250 | -9.978731 |
G | 60.54290 | -14.24470 |
H | 0.000000 | 0.000000 |
Reference | Chase, 1998 | Chase, 1998 |
Comment | Data last reviewed in June, 1966 | Data last reviewed in June, 1966 |

Gas phase ion energetics data

Data evaluated as indicated in comments:
L - Sharon G. Lias
Data compiled as indicated in comments:
LL - Sharon G. Lias and Joel F. Liebman
LLK - Sharon G. Lias, Rhoda D. Levin, and Sherif A. Kafafi
RDSH - Henry M. Rosenstock, Keith Draxl, Bruce W. Steiner, and John T. Herron
B - John E. Bartmess
Quantity | Value | Units | Method | Reference | Comment |
---|---|---|---|---|---|
IE (evaluated) | 7.98 | eV | N/A | N/A | L |
Electron affinity determinations
EA (eV) | Method | Reference | Comment |
---|---|---|---|
0.816265 ± 0.000074 | LPD | Lindahl, Andersson, et al., 2010 | Given: 6583.6(6) cm-1; B |
0.8170 ± 0.0040 | LPES | Bengali, Casey, et al., 1992 | B |
0.8160 ± 0.0080 | LPES | Feigerle, Corderman, et al., 1981 | B |
Ionization energy determinations
IE (eV) | Method | Reference | Comment |
---|---|---|---|
7.98 | EVAL | Lide, 1992 | LL |
7.49 ± 0.08 | EI | Rauh and Ackermann, 1979 | LLK |
7.98 | S | Moore, 1970 | RDSH |
7.98 | S | Moore, 1970 | RDSH |

Gas phase thermochemistry data

Quantity | Value | Units | Method | Reference | Comment |
---|---|---|---|---|---|
ΔfH°gas | 851.03 | kJ/mol | Review | Chase, 1998 | Data last reviewed in June, 1966 |
Quantity | Value | Units | Method | Reference | Comment |
S°gas,1 bar | 173.96 | J/mol*K | Review | Chase, 1998 | Data last reviewed in June, 1966 |

References

Chase, 1998
Chase, M.W., Jr.,
NIST-JANAF Themochemical Tables, Fourth Edition,
J. Phys. Chem. Ref. Data, Monograph 9, 1998, 1-1951. [all data]
Lindahl, Andersson, et al., 2010
Lindahl, A.O.; Andersson, P.; Diehl, C.; Forstner, O.; Klason, P.; Hanstorp, D.,
The electron affinity of tungsten,
Eur. Phys. J. D, 2010, 60, 2, 219-222, https://doi.org/10.1140/epjd/e2010-00199-y
. [all data]
Bengali, Casey, et al., 1992
Bengali, A.A.; Casey, S.M.; Cheng, C.-L.; Dick, J.P.; Fenn, T.; Villaalta, P.W.; Leopold, D.G.,
Negative Ion Photoelectron Spectroscopy of Coordinatively Unsaturated Group VI Metal Carbonyls: Cr(CO)3, Mo(CO)3, and W(CO)3,
J. Am. Chem. Soc., 1992, 114, 13, 5257, https://doi.org/10.1021/ja00039a043
. [all data]
Feigerle, Corderman, et al., 1981
Feigerle, C.S.; Corderman, R.R.; Bobashev, S.V.; Lineberger, W.C.,
Binding Energies and Structure of Transition Metal Negative Ions,
J. Chem. Phys., 1981, 74, 3, 1580, https://doi.org/10.1063/1.441289
. [all data]
Lide, 1992
Lide, D.R. (Editor),
Ionization potentials of atoms and atomic ions
in Handbook of Chem. and Phys., 1992, 10-211. [all data]
Rauh and Ackermann, 1979
Rauh, E.G.; Ackermann, R.J.,
The first ionization potentials of the transition metals,
J. Chem. Phys., 1979, 70, 1004. [all data]
Moore, 1970
Moore, C.E.,
Ionization potentials and ionization limits derived from the analyses of optical spectra,
Natl. Stand. Ref. Data Ser., (U.S. Natl. Bur. Stand.), 1970, 34, 1. [all data]