strontium
- Formula: Sr
- Molecular weight: 87.62
- IUPAC Standard InChIKey: CIOAGBVUUVVLOB-UHFFFAOYSA-N
- CAS Registry Number: 7440-24-6
- Chemical structure:
- NIST Atomic Spectra Database - Lines Holdings (on physics web site)
- NIST Atomic Spectra Database - Levels Holdings (on physics web site)
- NIST Atomic Spectra Database - Ground states and ionization energies (on physics web site)
- Gas Phase Kinetics Database
- X-ray Photoelectron Spectroscopy Database, version 5.0

Condensed phase thermochemistry data

Quantity | Value | Units | Method | Reference | Comment |
---|---|---|---|---|---|
ΔfH°liquid | 0.91 | kJ/mol | Review | Chase, 1998 | Data last reviewed in September, 1983 |
Quantity | Value | Units | Method | Reference | Comment |
S°liquid,1 bar | 50.90 | J/mol*K | Review | Chase, 1998 | Data last reviewed in September, 1983 |
Liquid Phase Heat Capacity (Shomate Equation)
Cp° = A + B*t + C*t2 + D*t3 +
E/t2
H° − H°298.15= A*t + B*t2/2 +
C*t3/3 + D*t4/4 − E/t + F − H
S° = A*ln(t) + B*t + C*t2/2 + D*t3/3 −
E/(2*t2) + G
Cp = heat capacity (J/mol*K)
H° = standard enthalpy (kJ/mol)
S° = standard entropy (J/mol*K)
t = temperature (K) / 1000.
View plot Requires a JavaScript / HTML 5 canvas capable browser.
Temperature (K) | 1050. to 1685.492 |
---|---|
A | 39.46303 |
B | -2.250084×10-10 |
C | 1.245422×10-10 |
D | -2.152389×10-11 |
E | -7.007113×10-12 |
F | -10.85530 |
G | 98.65705 |
H | 0.911003 |
Reference | Chase, 1998 |
Comment | Data last reviewed in September, 1983 |
Solid Phase Heat Capacity (Shomate Equation)
Cp° = A + B*t + C*t2 + D*t3 +
E/t2
H° − H°298.15= A*t + B*t2/2 +
C*t3/3 + D*t4/4 − E/t + F − H
S° = A*ln(t) + B*t + C*t2/2 + D*t3/3 −
E/(2*t2) + G
Cp = heat capacity (J/mol*K)
H° = standard enthalpy (kJ/mol)
S° = standard entropy (J/mol*K)
t = temperature (K) / 1000.
View plot Requires a JavaScript / HTML 5 canvas capable browser.
Temperature (K) | 298. to 1050. | 298. to 1050. |
---|---|---|
A | 23.88223 | 26.36179 |
B | 9.297351 | 4.177331 |
C | 0.919924 | 0.005861 |
D | 0.035243 | -0.001724 |
E | 0.004934 | -0.000095 |
F | -7.525384 | -6.834815 |
G | 81.80933 | 87.83053 |
H | 0.000000 | 1.211001 |
Reference | Chase, 1998 | Chase, 1998 |
Comment | α phase; Data last reviewed in September, 1983 | β phase; Data last reviewed in September, 1983 |

Gas phase ion energetics data

Data evaluated as indicated in comments:
L - Sharon G. Lias
Data compiled as indicated in comments:
LL - Sharon G. Lias and Joel F. Liebman
LLK - Sharon G. Lias, Rhoda D. Levin, and Sherif A. Kafafi
RDSH - Henry M. Rosenstock, Keith Draxl, Bruce W. Steiner, and John T. Herron
B - John E. Bartmess
Quantity | Value | Units | Method | Reference | Comment |
---|---|---|---|---|---|
IE (evaluated) | 5.69484 ± 0.00002 | eV | N/A | N/A | L |
Electron affinity determinations
EA (eV) | Method | Reference | Comment |
---|---|---|---|
0.052038 ± 0.000044 | N/A | Andersen, Petrunin, et al., 1997 | B |
0.0480 ± 0.0060 | LPD | Berkovits, Boaretto, et al., 1995 | B |
Ionization energy determinations
IE (eV) | Method | Reference | Comment |
---|---|---|---|
5.69484 | EVAL | Lide, 1992 | LL |
5.5 ± 0.5 | EI | Asano and Kou, 1988 | LL |
5.5 ± 0.3 | EI | Kleinschmidt and Hildenbrand, 1978 | LLK |
5.5 | PE | Hildenbrand, 1977 | LLK |
~5.7 | EI | Okudaira, 1970 | RDSH |
5.69484 ± 0.00002 | S | Moore, 1970 | RDSH |

References

Chase, 1998
Chase, M.W., Jr.,
NIST-JANAF Themochemical Tables, Fourth Edition,
J. Phys. Chem. Ref. Data, Monograph 9, 1998, 1-1951. [all data]
Andersen, Petrunin, et al., 1997
Andersen, H.H.; Petrunin, V.V.; Kristensen, P.; Andersen, T.,
Structural properties of the negative strontium ion: Binding energy and fine-structure splitting,
Phys. Rev. A, 1997, 55, 4, 3247-3249, https://doi.org/10.1103/PhysRevA.55.3247
. [all data]
Berkovits, Boaretto, et al., 1995
Berkovits, D.; Boaretto, E.; Ghelberg, S.; Heber, O.; Paul, M.,
Electron affinity of strontium,
Phys. Rev. Lett., 1995, 75, 3, 414, https://doi.org/10.1103/PhysRevLett.75.414
. [all data]
Lide, 1992
Lide, D.R. (Editor),
Ionization potentials of atoms and atomic ions
in Handbook of Chem. and Phys., 1992, 10-211. [all data]
Asano and Kou, 1988
Asano, M.; Kou, T.,
Thermochemical properties of SrBO2(g) and SrB2O4(s),
J. Chem. Thermodyn., 1988, 20, 1149. [all data]
Kleinschmidt and Hildenbrand, 1978
Kleinschmidt, P.D.; Hildenbrand, D.L.,
Dissociation energies of CaI, SrI, and BaI from high temperature mass spectrometry,
J. Chem. Phys., 1978, 68, 2819. [all data]
Hildenbrand, 1977
Hildenbrand, D.L.,
Dissociation energies of CaBr, SrBr, BaBr, and BaCl from mass spectrometric studies of gaseous equilibria,
J. Chem. Phys., 1977, 66, 3526. [all data]
Okudaira, 1970
Okudaira, S.,
Multiple ionization of Ca, Sr and Ba by electron impact,
J. Phys. Soc. Jpn., 1970, 29, 409. [all data]
Moore, 1970
Moore, C.E.,
Ionization potentials and ionization limits derived from the analyses of optical spectra,
Natl. Stand. Ref. Data Ser., (U.S. Natl. Bur. Stand.), 1970, 34, 1. [all data]