rubidium
- Formula: Rb
- Molecular weight: 85.4678
- IUPAC Standard InChIKey: IGLNJRXAVVLDKE-UHFFFAOYSA-N
- CAS Registry Number: 7440-17-7
- Chemical structure:
- NIST Atomic Spectra Database - Lines Holdings (on physics web site)
- NIST Atomic Spectra Database - Levels Holdings (on physics web site)
- NIST Atomic Spectra Database - Ground states and ionization energies (on physics web site)
- Gas Phase Kinetics Database
- X-ray Photoelectron Spectroscopy Database, version 5.0

Gas phase thermochemistry data

Quantity | Value | Units | Method | Reference | Comment |
---|---|---|---|---|---|
ΔfH°gas | 80.9 ± 0.8 | kJ/mol | Review | Cox, Wagman, et al., 1984 | CODATA Review value |
ΔfH°gas | 80.90 | kJ/mol | Review | Chase, 1998 | Data last reviewed in December, 1983 |
Quantity | Value | Units | Method | Reference | Comment |
S°gas,1 bar | 170.094 ± 0.003 | J/mol*K | Review | Cox, Wagman, et al., 1984 | CODATA Review value |
S°gas,1 bar | 170.09 | J/mol*K | Review | Chase, 1998 | Data last reviewed in December, 1983 |
Gas Phase Heat Capacity (Shomate Equation)
Cp° = A + B*t + C*t2 + D*t3 +
E/t2
H° − H°298.15= A*t + B*t2/2 +
C*t3/3 + D*t4/4 − E/t + F − H
S° = A*ln(t) + B*t + C*t2/2 + D*t3/3 −
E/(2*t2) + G
Cp = heat capacity (J/mol*K)
H° = standard enthalpy (kJ/mol)
S° = standard entropy (J/mol*K)
t = temperature (K) / 1000.
View plot Requires a JavaScript / HTML 5 canvas capable browser.
Temperature (K) | 970.385 to 1800. | 1800. to 6000. |
---|---|---|
A | 20.63963 | 74.13588 |
B | 0.461826 | -39.23458 |
C | -0.494817 | 9.907546 |
D | 0.173669 | -0.679452 |
E | 0.004386 | -35.14100 |
F | 74.74465 | 4.967789 |
G | 194.9782 | 214.2995 |
H | 80.90015 | 80.90015 |
Reference | Chase, 1998 | Chase, 1998 |
Comment | Data last reviewed in December, 1983 | Data last reviewed in December, 1983 |

Reaction thermochemistry data

Data compiled by: John E. Bartmess
Individual Reactions
By formula: (Br- • 4294967295Rb) + Rb = Br-
Quantity | Value | Units | Method | Reference | Comment |
---|---|---|---|---|---|
ΔrH° | 111. ± 4.2 | kJ/mol | Ther | Miller, Leopold, et al., 1986 | gas phase; Extrapolated by polarizability and radius from experimental data. |
(CAS Reg. No. 106070-95-5 • 4294967295) +
= CAS Reg. No. 106070-95-5
By formula: (CAS Reg. No. 106070-95-5 • 4294967295Rb) + Rb = CAS Reg. No. 106070-95-5
Quantity | Value | Units | Method | Reference | Comment |
---|---|---|---|---|---|
ΔrH° | 134.8 ± 1.0 | kJ/mol | N/A | Miller, Leopold, et al., 1986 | gas phase |

Gas phase ion energetics data

Data evaluated as indicated in comments:
L - Sharon G. Lias
Data compiled as indicated in comments:
LL - Sharon G. Lias and Joel F. Liebman
LLK - Sharon G. Lias, Rhoda D. Levin, and Sherif A. Kafafi
RDSH - Henry M. Rosenstock, Keith Draxl, Bruce W. Steiner, and John T. Herron
B - John E. Bartmess
Quantity | Value | Units | Method | Reference | Comment |
---|---|---|---|---|---|
IE (evaluated) | 4.17713 ± 0.000002 | eV | N/A | N/A | L |
Electron affinity determinations
EA (eV) | Method | Reference | Comment |
---|---|---|---|
0.485940 ± 0.000044 | LPD | Frey, Breyer, et al., 1978 | Given: 3919.18(16) cm-1; B |
0.4860 ± 0.0030 | LPES | Patterson, Hotop, et al., 1974 | B |
Ionization energy determinations
IE (eV) | Method | Reference | Comment |
---|---|---|---|
4.17713 | EVAL | Lide, 1992 | LL |
4.18 | PE | Williams and Potts, 1976 | LLK |
4.17713 ± 0.000002 | S | Moore, 1970 | RDSH |

Ion clustering data

Data compiled by: John E. Bartmess
Clustering reactions
By formula: (Br- • 4294967295Rb) + Rb = Br-
Quantity | Value | Units | Method | Reference | Comment |
---|---|---|---|---|---|
ΔrH° | 111. ± 4.2 | kJ/mol | Ther | Miller, Leopold, et al., 1986 | gas phase; Extrapolated by polarizability and radius from experimental data. |

Condensed phase thermochemistry data

Quantity | Value | Units | Method | Reference | Comment |
---|---|---|---|---|---|
ΔfH°liquid | 2.18 | kJ/mol | Review | Chase, 1998 | Data last reviewed in December, 1983 |
Quantity | Value | Units | Method | Reference | Comment |
S°liquid,1 bar | 83.76 | J/mol*K | Review | Chase, 1998 | Data last reviewed in December, 1983 |
Quantity | Value | Units | Method | Reference | Comment |
S°solid,1 bar | 76.78 ± 0.30 | J/mol*K | Review | Cox, Wagman, et al., 1984 | CODATA Review value |
Quantity | Value | Units | Method | Reference | Comment |
S°solid | 76.78 | J/mol*K | Review | Chase, 1998 | Data last reviewed in December, 1983 |
Liquid Phase Heat Capacity (Shomate Equation)
Cp° = A + B*t + C*t2 + D*t3 +
E/t2
H° − H°298.15= A*t + B*t2/2 +
C*t3/3 + D*t4/4 − E/t + F − H
S° = A*ln(t) + B*t + C*t2/2 + D*t3/3 −
E/(2*t2) + G
Cp = heat capacity (J/mol*K)
H° = standard enthalpy (kJ/mol)
S° = standard entropy (J/mol*K)
t = temperature (K) / 1000.
View plot Requires a JavaScript / HTML 5 canvas capable browser.
Temperature (K) | 312.65 to 970.385 |
---|---|
A | 35.49727 |
B | -12.87341 |
C | 8.550047 |
D | -0.002827 |
E | -0.000119 |
F | -7.902990 |
G | 130.1797 |
H | 2.184003 |
Reference | Chase, 1998 |
Comment | Data last reviewed in December, 1983 |
Solid Phase Heat Capacity (Shomate Equation)
Cp° = A + B*t + C*t2 + D*t3 +
E/t2
H° − H°298.15= A*t + B*t2/2 +
C*t3/3 + D*t4/4 − E/t + F − H
S° = A*ln(t) + B*t + C*t2/2 + D*t3/3 −
E/(2*t2) + G
Cp = heat capacity (J/mol*K)
H° = standard enthalpy (kJ/mol)
S° = standard entropy (J/mol*K)
t = temperature (K) / 1000.
View plot Requires a JavaScript / HTML 5 canvas capable browser.
Temperature (K) | 298. to 312.65 |
---|---|
A | 9.446260 |
B | 65.31182 |
C | 45.51230 |
D | -26.78961 |
E | -0.107730 |
F | -6.429511 |
G | 66.34569 |
H | 0.000000 |
Reference | Chase, 1998 |
Comment | Data last reviewed in December, 1983 |

References

Cox, Wagman, et al., 1984
Cox, J.D.; Wagman, D.D.; Medvedev, V.A.,
CODATA Key Values for Thermodynamics, Hemisphere Publishing Corp., New York, 1984, 1. [all data]
Chase, 1998
Chase, M.W., Jr.,
NIST-JANAF Themochemical Tables, Fourth Edition,
J. Phys. Chem. Ref. Data, Monograph 9, 1998, 1-1951. [all data]
Miller, Leopold, et al., 1986
Miller, T.M.; Leopold, D.G.; Murray, K.K.; Lineberger, W.C.,
Electron Affinities of the Alkali Halides and the Structure of their Negative Ions,
J. Chem. Phys., 1986, 85, 5, 2368, https://doi.org/10.1063/1.451091
. [all data]
Frey, Breyer, et al., 1978
Frey, P.; Breyer, F.; Hotop, H.,
High Resolutions Photodetachment from the Rubidium Negative Ion around the Rb(5p1/2) Threshold,
J. Phys. B: Atom. Mol. Phys., 1978, 11, 19, L589, https://doi.org/10.1088/0022-3700/11/19/005
. [all data]
Patterson, Hotop, et al., 1974
Patterson, T.A.; Hotop, H.; Kasdan, A.; Norcross, D.W.; Lineberger, W.C.,
Resonances in Alkali Negative-Ion Photodetachment and Electron Affinities of the Corresponding Neutrals,
Phys. Rev. Lett., 1974, 32, 5, 189, https://doi.org/10.1103/PhysRevLett.32.189
. [all data]
Lide, 1992
Lide, D.R. (Editor),
Ionization potentials of atoms and atomic ions
in Handbook of Chem. and Phys., 1992, 10-211. [all data]
Williams and Potts, 1976
Williams, T.A.; Potts, A.W.,
Complexities in the HeI photoelectron spectra of alkali metal vapours,
J. Electron Spectrosc. Relat. Phenom., 1976, 8, 331. [all data]
Moore, 1970
Moore, C.E.,
Ionization potentials and ionization limits derived from the analyses of optical spectra,
Natl. Stand. Ref. Data Ser., (U.S. Natl. Bur. Stand.), 1970, 34, 1. [all data]